program: Gaussian 09
title: 000234474
version: EM64L-G09RevD.01
frameworkgroup: C1[X(C13H9N3O2S)]
method: RPBEPBE
basis: SDD
operation: Freq
keyword: #p
keyword: freq=noraman
keyword: PBEPBE/SDD
title: #p freq=noraman PBEPBE/SDD
converged: NO NO NO NO
title: Mulliken charges:
elementType: S O O N N N C C C C C C C C C C C C C H H H H H H H H H
charge: 0.215504 -0.221813 -0.217836 -0.374561 -0.079363 0.018640 -0.318393 0.401910 0.474923 -0.201373 -0.433798 -0.295031 -0.276996 -0.345499 0.394760 -0.349096 -0.376062 -0.240991 -0.207797 0.326935 0.233453 0.323668 0.247693 0.257181 0.288838 0.286376 0.234094 0.234633
chargesum: 0.00000
title: Mulliken charges with hydrogens summed into heavy atoms:
elementType: S O O N N N C C C C C C C C C C C C C
charge: 0.215504 -0.221813 -0.217836 -0.047626 -0.079363 0.018640 -0.318393 0.401910 0.474923 -0.201373 -0.200345 0.028637 -0.029303 -0.088318 0.394760 -0.060258 -0.089686 -0.006897 0.026836
polarizability: 4.19593020e+02 -6.94166888e+00 2.02922654e+02 -3.73123149e-03 -1.50938889e-04 6.69225060e+01
1716.lowfreq: -0.9170 -0.0017 -0.0014 -0.0008 2.3878 8.3928 32.7767 45.8209 64.2278
frequency: 32.7297 45.5856 64.2268 81.9599 93.3718 155.4332 177.3600 186.4000 202.1686 289.3915 291.2715 323.7416 363.2804 405.8384 420.4473 431.7567 483.5387 492.2902 494.1521 519.5601 538.4921 581.9710 598.8636 601.1862 622.2645 644.8021 668.0990 674.2711 728.9114 737.0582 751.0844 763.5850 769.6629 826.8108 833.0578 861.5800 879.6676 889.2991 944.2447 978.7163 984.1733 999.5208 1014.4612 1015.8080 1034.4411 1095.2432 1101.8306 1118.4475 1127.2240 1171.1378 1178.6400 1223.9320 1240.9290 1265.6848 1296.1441 1304.9668 1345.7490 1376.5846 1394.3282 1434.7634 1435.4474 1446.1074 1485.7168 1528.6330 1564.5449 1578.2518 1600.5059 1611.7172 1623.5243 3126.7659 3140.3969 3153.8947 3167.5865 3176.0740 3177.8532 3187.8499 3191.3367 3537.6455
redmass: 7.1270 5.9305 7.3473 7.2792 6.9573 5.6549 8.9365 5.7682 10.9319 6.4315 5.9783 4.7558 7.9936 9.8791 3.0294 3.1775 9.5151 2.7917 8.8476 6.8372 4.6826 3.3100 1.6017 8.7834 7.3064 7.8939 4.8090 7.1692 2.8083 4.4258 7.5223 1.4979 8.4525 6.5085 1.3913 1.3813 1.4649 7.1900 1.3819 1.3415 1.3207 3.1521 1.3130 2.7694 3.5591 3.5027 2.8271 1.3504 1.6767 1.0991 1.4938 3.7490 2.5212 1.7615 1.9249 1.5802 8.3946 4.6618 5.7397 2.9543 4.4825 2.6943 2.5752 1.8773 6.9663 7.3832 4.6369 6.1449 8.0586 1.0908 1.0858 1.0904 1.0954 1.0898 1.1002 1.0945 1.0970 1.0763
irintensity: 0.2199 0.0607 0.5598 0.9591 3.4076 0.3730 3.2492 2.3278 1.5632 2.2424 2.0163 1.9959 1.9671 9.2274 0.1957 9.4022 1.2963 29.1105 2.5621 1.3318 0.4789 14.6559 44.5161 12.4503 1.6653 13.6407 20.9256 5.0194 11.2508 11.1308 18.5877 87.7969 3.9211 4.8526 32.7813 0.2460 65.2830 34.3206 3.5436 1.0101 0.1120 0.0124 0.1912 19.0960 2.4345 1.3022 127.1311 17.2537 12.8462 10.0407 343.1742 626.3843 31.3126 55.2523 13.5643 42.8066 92.9689 2.0178 172.1960 18.7328 26.5979 28.8348 33.5709 253.0300 298.8565 289.5595 80.6689 446.5173 55.0968 10.7514 1.5667 7.9820 14.7742 6.1451 20.2433 4.1447 2.5898 42.6464
temp: 298.150 k
press: 1.00000 atm
elementType: 16 8 8 7 7 7 6 6 6 6 6 6 6 6 6 6 6 6 6 1 1 1 1 1 1 1 1 1
symmnumber: 1
zpe: 519813.3 jmol-1
zpe.correction: 0.197986 hartree
zpe.thermalcorrener: 0.213151 hartree
zpe.thermalcorrenthalpy: 0.214095 hartree
zpe.thermalcorrgfe: 0.154109 hartree
zpe.sumelectzpe: -1212.169574 hartree
zpe.sumelectthermal: -1212.154410 hartree
zpe.sumelectthermalent: -1212.153466 hartree
zpe.sumelectthermalfe: -1212.213452 hartree
dipole: -6.9889 -3.2916 0.0020
dipole: 7.7253
quadrupole: -144.4054 -103.6919 -121.5116
quadrupole: -14.6699 0.0135 0.0026
quadrupole: -21.2024 19.5111 1.6913 -14.6699 0.0135 0.0026
hfenergy: -1212.3675609 hartree
pointgroup: C01 [X(C13H9N3O2S1)]
dipole: 2.70038 1.3948598 0.0007913 debye
polarizability: 419.8105088|1.008029|202.7051649|0.0037232|0.0002875|66.922506 unknown
InChI: InChI=1S/C13H9N3O2S/c17-16(18)10-7-5-9(6-8-10)14-13-15-11-3-1-2-4-12(11)19-13/h1-8,14H
charge 0 multiplicity 1
28 atoms
S  2.736357 2.166423 -0.000169
O  -6.181079 -0.014084 -0.000734
O  -5.255269 -2.105488 -0.000648
N  0.010473 1.563889 -0.000046
N  1.573011 -0.28769 -0.000049
N  -5.158997 -0.812868 0.000391
C  3.779502 0.673349 -0.000163
C  2.963891 -0.506343 -0.000095
C  -1.246328 0.92146 0.000051
C  1.272285 0.993071 -0.000079
C  -2.403649 1.755231 0.000071
C  -1.393201 -0.495531 0.000133
C  5.182994 0.606448 -0.000216
C  3.584996 -1.77676 -0.000078
C  -3.813888 -0.21591 0.000277
C  -3.686691 1.192837 0.000174
C  -2.679637 -1.058344 0.000241
C  5.785141 -0.674066 -0.000197
C  4.992424 -1.851234 -0.000129
H  -0.015248 2.585757 -0.000101
H  -2.291553 2.846471 0.000006
H  -0.498797 -1.120892 0.000104
H  5.799437 1.510059 -0.000269
H  2.96247 -2.676175 -0.000026
H  -4.58635 1.812723 0.00019
H  -2.821322 -2.142174 0.000313
H  6.877241 -0.75182 -0.000236
H  5.480987 -2.831039 -0.000115
