program: Gaussian 09
title: 000234473
version: EM64L-G09RevD.01
frameworkgroup: C1[X(C12H15NO5S)]
method: RPBEPBE
basis: SDD
operation: Freq
keyword: #p
keyword: freq=noraman
keyword: PBEPBE/SDD
title: #p freq=noraman PBEPBE/SDD
converged: YES YES NO NO
title: Mulliken charges:
elementType: S O O O O O N C C C C C C C C C C C C H H H H H H H H H H H H H H H
charge: 0.323927 -0.510452 -0.518946 -0.450949 -0.465195 -0.534314 -0.163687 -0.196719 -0.087825 -0.107746 -0.085416 -0.164513 -0.363470 -0.388074 0.404267 -0.278640 -0.357401 -0.238448 -0.206764 0.262841 0.229575 0.258011 0.274009 0.239628 0.230377 0.392000 0.387972 0.384990 0.373474 0.248628 0.257792 0.382785 0.233795 0.234488
chargesum: 0.00000
title: Mulliken charges with hydrogens summed into heavy atoms:
elementType: S O O O O O N C C C C C C C C C C C C
charge: 0.323927 -0.118452 -0.130974 -0.065959 -0.091721 -0.151529 -0.163687 0.066121 0.141750 0.150265 0.188593 -0.164513 0.106534 -0.388074 0.404267 -0.030012 -0.099609 -0.004653 0.027724
polarizability: 2.51836676e+02 3.83534258e+00 1.66584548e+02 1.81432582e+01 7.41961602e+00 1.01591224e+02
1716.lowfreq: -9.0900 -0.0019 0.0011 0.0017 1.3278 6.6551 31.2837 36.8075 65.8578
frequency: 31.2171 36.7819 65.8552 78.9675 105.9251 128.6926 151.8201 171.0380 184.9813 198.5652 202.1173 229.6995 263.3832 274.2399 289.8727 324.7414 329.5648 353.4000 381.1165 397.1450 434.6292 455.6961 489.3376 494.2969 511.6285 531.9635 555.3645 565.8712 574.4898 602.6048 646.9034 656.9284 685.2817 709.6468 738.2384 754.6032 774.5111 808.4518 857.9234 866.9735 870.1894 939.9848 944.6785 950.7353 964.8434 982.2663 988.1140 1000.7956 1015.5206 1036.5357 1049.9045 1064.3817 1076.7260 1086.5129 1119.9932 1132.7879 1170.6650 1179.7773 1196.5887 1214.5964 1221.5273 1231.3016 1258.6083 1273.6329 1280.8034 1297.1793 1316.8418 1328.1547 1343.7778 1370.2555 1381.4066 1387.8992 1406.1246 1426.3716 1432.3446 1440.6769 1447.9794 1473.4913 1502.6576 1569.8194 1606.0731 2970.4136 2981.5585 2996.8013 2999.3577 3066.0397 3081.8990 3094.5358 3138.0391 3151.0182 3162.7586 3164.4311 3175.1795 3461.5557 3476.4401 3625.8297
redmass: 6.0861 6.1436 6.1030 6.5844 6.8991 7.9563 3.9611 2.3932 5.2639 3.4749 1.9745 4.7220 5.2028 5.2800 5.0122 5.5854 4.6338 7.0959 7.9757 4.0001 3.2064 5.6724 8.2003 4.8916 5.5654 1.2495 2.1367 1.3974 4.0768 5.3465 3.1451 6.6597 7.4896 4.9561 2.3657 1.1984 1.6268 1.4072 5.3349 1.4050 2.0269 2.4161 7.7913 1.3847 5.6548 4.7467 1.3244 5.8945 2.5001 4.1451 2.9845 3.5694 2.8365 2.0594 1.7075 3.3083 1.1263 1.1138 1.2002 1.2269 1.2385 2.6640 1.1889 1.3602 1.3344 1.2559 1.2291 1.1717 1.2456 1.3350 5.0288 1.4652 1.4369 1.4848 2.4564 1.2043 2.4167 1.0774 10.1982 6.3616 7.0783 1.0828 1.0826 1.0581 1.0843 1.0979 1.0975 1.0714 1.0858 1.0901 1.0699 1.0933 1.1003 1.0648 1.0648 1.0671
irintensity: 0.9855 0.8773 4.4218 0.7846 0.4381 5.9006 15.8185 57.0501 2.3820 15.3291 70.3595 23.4346 12.9526 7.8429 15.4403 2.6798 9.7895 3.3617 1.6788 3.5971 14.5686 3.4303 1.4134 9.9206 4.8448 223.0818 10.5587 109.2859 6.4974 23.0767 42.6283 14.2888 2.8219 18.5112 43.9283 40.5160 138.7493 92.0686 49.9792 2.2174 49.3965 24.5653 101.8267 3.1995 13.5248 85.2088 0.1003 88.2284 6.7815 2.5892 22.9773 44.0167 12.5238 87.6054 41.8287 56.5841 0.3698 13.1155 10.6529 11.9041 5.6244 14.2073 38.3493 25.6158 64.8699 1.8358 22.7451 2.0715 2.8172 151.2703 7.2646 21.8843 50.3183 150.5505 34.9938 33.1785 0.3485 10.3748 38.6995 1.9587 1.1327 17.9063 10.5889 75.6407 58.2068 6.7331 30.7576 728.6453 1.2853 12.9455 595.6586 21.9050 15.0704 52.4189 41.5314 17.7315
temp: 298.150 k
press: 1.00000 atm
elementType: 16 8 8 8 8 8 7 6 6 6 6 6 6 6 6 6 6 6 6 1 1 1 1 1 1 1 1 1 1 1 1 1 1 1
symmnumber: 1
zpe: 684520.2 jmol-1
zpe.correction: 0.260720 hartree
zpe.thermalcorrener: 0.278784 hartree
zpe.thermalcorrenthalpy: 0.279728 hartree
zpe.thermalcorrgfe: 0.214487 hartree
zpe.sumelectzpe: -1293.754249 hartree
zpe.sumelectthermal: -1293.736185 hartree
zpe.sumelectthermalent: -1293.735241 hartree
zpe.sumelectthermalfe: -1293.800482 hartree
dipole: 3.7969 -0.7700 3.6846
dipole: 5.3466
quadrupole: -117.3791 -115.5141 -115.5203
quadrupole: 3.5190 -6.9677 -6.5943
quadrupole: -1.2413 0.6238 0.6175 3.5190 -6.9677 -6.5943
hfenergy: -1294.0149686 hartree
pointgroup: C01 [X(C12H15N1O5S1)]
dipole: -1.326738 1.4494411 -0.7507359 debye
polarizability: 246.6692162|-32.2845837|114.3116805|8.2646688|20.8048251|159.0315518 unknown
InChI: InChI=1S/C12H15NO5S/c14-5-7(15)9(16)10(17)11(18)12-13-6-3-1-2-4-8(6)19-12/h1-4,7,9-11,14-18H,5H2
charge 0 multiplicity 1
34 atoms
S  -1.689589 -1.033465 -1.622977
O  1.013887 -0.067319 2.170472
O  3.6185 0.203263 2.044225
O  1.233036 -1.53964 -1.316147
O  5.351317 -0.903857 0.409875
O  2.778851 0.529936 -1.856268
N  -1.353869 -0.061915 0.858466
C  1.566536 -0.233929 0.816633
C  3.008507 -0.719835 1.068022
C  0.701556 -1.244716 0.003857
C  3.992813 -0.738588 -0.125185
C  -0.723097 -0.727134 -0.095751
C  3.995849 0.533812 -0.996508
C  -3.061077 -0.162315 -0.810473
C  -2.676101 0.276153 0.498223
C  -4.348116 0.099851 -1.320169
C  -3.594338 0.985116 1.307042
C  -5.255171 0.808873 -0.501481
C  -4.881232 1.246546 0.798689
H  1.57497 0.741307 0.287923
H  2.965499 -1.739839 1.50529
H  0.685014 -2.204907 0.558531
H  3.793332 -1.615744 -0.761348
H  4.901706 0.5006 -1.62842
H  4.0063 1.44098 -0.362359
H  0.026161 0.126299 2.060461
H  2.909869 0.386806 2.720655
H  1.730035 -0.728205 -1.674457
H  5.365098 -0.405436 1.274211
H  -4.644732 -0.234263 -2.319001
H  -3.293318 1.314689 2.305841
H  2.855932 1.183194 -2.590243
H  -6.261817 1.022485 -0.876225
H  -5.605313 1.793096 1.411895
