program: Gaussian 09
title: 000022225
version: EM64L-G09RevD.01
frameworkgroup: C1[X(C8H15N5O2)]
method: RPBEPBE
basis: SDD
operation: Freq
keyword: #p
keyword: freq=noraman
keyword: PBEPBE/SDD
title: #p freq=noraman PBEPBE/SDD
converged: YES YES NO NO
title: Mulliken charges:
elementType: O O N N N N N C C C C C C C C H H H H H H H H H H H H H H H
charge: -0.471228 -0.442794 -0.326811 -0.323190 -0.157058 -0.110516 -0.110362 -0.351800 -0.363925 0.065679 0.068558 -0.310667 -0.343641 0.070342 -0.751318 0.230130 0.243862 0.245681 0.212525 0.342618 0.341508 0.196029 0.206703 0.233952 0.197848 0.235530 0.239009 0.238854 0.353864 0.340619
chargesum: 0.00000
title: Mulliken charges with hydrogens summed into heavy atoms:
elementType: O O N N N N N C C C C C C C C
charge: -0.117364 -0.102174 0.015807 0.018317 -0.157058 -0.110516 -0.110362 0.122192 0.094281 0.065679 0.068558 0.092065 0.088159 0.070342 -0.037925
polarizability: 1.78822336e+02 -7.59579461e-01 1.53923653e+02 1.12238626e+00 5.44883841e+00 8.33565308e+01
1716.lowfreq: -41.7908 -7.4871 -0.7742 0.0000 0.0003 0.0010 6.4562 22.9928 33.4907
frequency: -41.7749 22.9669 33.4616 58.2505 71.9878 89.3237 101.2006 130.0162 177.6285 185.4248 198.4632 208.5242 273.8937 277.7820 302.0365 330.3932 353.6453 426.8921 456.4029 477.2906 530.7786 548.3772 601.0143 642.1612 672.9268 673.9074 683.2567 715.4495 798.1176 836.3094 853.6080 880.2951 893.8821 897.3652 977.7630 980.0244 1013.7068 1030.6568 1046.8397 1051.6262 1069.0254 1083.0093 1136.8208 1148.9443 1174.5494 1189.5692 1202.5690 1213.8357 1229.7025 1264.2202 1312.1180 1322.8188 1330.5047 1353.9943 1363.2482 1377.8525 1389.0029 1400.6986 1416.5429 1453.0325 1456.0991 1461.3324 1462.2738 1470.2970 1476.0510 1486.4444 1508.2446 1537.2037 1592.9625 2929.1142 2955.8339 2979.3500 2982.8758 2995.0815 3019.8973 3057.5263 3085.7531 3087.7203 3095.6020 3130.1780 3543.6195 3557.1140 3560.6764 3586.0072
redmass: 1.0126 4.2990 4.4704 4.7295 3.5007 3.8013 3.1731 4.7944 6.4025 5.6120 4.0254 4.9370 2.4410 1.2659 2.5755 2.0960 1.1306 3.4121 3.8422 3.1540 2.9500 5.5092 3.3254 4.8911 1.8762 1.1450 1.6123 7.8521 9.0593 2.1796 2.4818 2.9885 2.6822 10.0927 2.7580 2.4107 1.6514 2.6907 2.1452 1.6323 1.6689 3.0708 2.0986 2.4428 1.3826 1.4874 2.2685 1.3474 1.5979 1.3151 1.6439 1.3159 1.7972 1.6876 1.5818 1.2119 1.3198 1.4598 2.3929 1.1342 1.1321 1.0824 1.0865 1.0859 1.0819 3.3623 2.5265 6.5332 6.5123 1.0712 1.0554 1.0705 1.0674 1.0400 1.1056 1.0890 1.0920 1.0940 1.0984 1.1019 1.0766 1.0662 1.0765 1.0667
irintensity: 0.0493 1.9850 0.5233 0.1824 3.8324 10.4801 11.2300 4.3019 1.8362 3.5705 0.2995 1.7022 17.9687 136.2946 1.4793 34.4343 161.0678 21.0187 43.8352 1.3771 8.9002 6.4628 4.0375 2.3379 68.4988 83.8471 99.6950 1.4648 37.5101 18.2341 2.8640 0.3098 23.0982 10.5858 35.0591 66.1780 62.3281 61.7020 2.9082 11.6077 7.4751 5.9168 20.0840 10.7904 14.1225 74.0488 4.4842 14.8358 98.6137 25.6949 20.0702 12.3676 10.9723 27.9165 62.3156 18.9562 17.7463 2.9592 130.2814 22.5721 94.6546 14.8197 24.6759 8.5817 32.8128 318.9821 1.2705 1307.0174 333.2776 70.3972 67.2094 25.9874 82.3777 9.8450 98.0651 13.8300 16.6667 8.0812 26.7693 11.3668 111.6733 5.2592 85.3016 5.6862
temp: 298.150 k
press: 1.00000 atm
elementType: 8 8 7 7 7 7 7 6 6 6 6 6 6 6 6 1 1 1 1 1 1 1 1 1 1 1 1 1 1 1
symmnumber: 1
zpe: 639720.8 jmol-1
zpe.correction: 0.243657 hartree
zpe.thermalcorrener: 0.259238 hartree
zpe.thermalcorrenthalpy: 0.260182 hartree
zpe.thermalcorrgfe: 0.198641 hartree
zpe.sumelectzpe: -736.892902 hartree
zpe.sumelectthermal: -736.877321 hartree
zpe.sumelectthermalent: -736.876377 hartree
zpe.sumelectthermalfe: -736.937918 hartree
dipole: 1.0315 -4.9024 0.2755
dipole: 5.0173
quadrupole: -83.1639 -79.8833 -86.8696
quadrupole: -0.9749 15.0032 -0.5256
quadrupole: 0.1417 3.4223 -3.5640 -0.9749 15.0032 -0.5256
hfenergy: -737.1365591 hartree
pointgroup: C01[X(C8H15N5O2)]
dipole: 0.4435036 -1.903683 0.2752924 debye
polarizability: 178.850703|-0.2049355|154.315731|0.5077535|-0.8277743|82.9360859 unknown
InChI: InChI=1S/C8H15N5O2/c1-6-11-7(9-2-4-14)13-8(12-6)10-3-5-15/h9-10,14-15H,2-5H2,1H3
charge 0 multiplicity 1
30 atoms
O  4.904967 -1.343977 0.23946
O  -4.891523 -1.438362 0.204926
N  2.410965 -0.175655 -0.322975
N  -2.294647 -0.245767 -0.049221
N  0.056872 -0.303895 -0.195931
N  -1.184061 1.806375 -0.105505
N  1.24003 1.84073 -0.238277
C  2.601365 -1.625165 -0.355721
C  -2.43342 -1.699834 -0.097858
C  1.198758 0.456931 -0.248946
C  -1.102057 0.425141 -0.118995
C  3.675241 -2.052135 0.647747
C  -3.680562 -2.130839 0.688719
C  0.019702 2.452176 -0.164458
C  0.000411 3.958841 -0.121136
H  2.913776 -1.952632 -1.36792
H  1.633935 -2.099544 -0.122942
H  -1.522487 -2.15441 0.329681
H  -2.508314 -2.057257 -1.149747
H  3.240317 0.42061 -0.360857
H  -3.145525 0.321877 -0.026936
H  3.816732 -3.1521 0.598745
H  3.373738 -1.762051 1.67531
H  -3.59722 -1.822878 1.743332
H  -3.800722 -3.232552 0.638843
H  0.044263 4.304899 0.929012
H  0.876992 4.367278 -0.647911
H  -0.933347 4.341505 -0.562225
H  5.625551 -1.505438 0.897251
H  -5.105432 -1.757975 -0.708667
