program: Gaussian 09
title: 000234447
version: EM64L-G09RevD.01
frameworkgroup: C1[X(C14H8N4S2)]
method: RPBEPBE
basis: SDD
operation: Freq
keyword: #p
keyword: freq=noraman
keyword: PBEPBE/SDD
title: #p freq=noraman PBEPBE/SDD
converged: YES YES NO YES
title: Mulliken charges:
elementType: S S N N N N C C C C C C C C C C C C C C H H H H H H H H
charge: 0.297506 0.297507 0.034071 0.034070 0.005371 0.005371 -0.235390 -0.235390 -0.343545 -0.343547 0.480285 0.480286 -0.293640 -0.293641 -0.447922 -0.447922 -0.179610 -0.179611 -0.339857 -0.339857 0.283791 0.283791 0.250389 0.250390 0.238141 0.238141 0.250412 0.250411
chargesum: 0.00000
title: Mulliken charges with hydrogens summed into heavy atoms:
elementType: S S N N N N C C C C C C C C C C C C C C
charge: 0.297506 0.297507 0.034071 0.034070 0.005371 0.005371 -0.235390 -0.235390 -0.343545 -0.343547 0.480285 0.480286 -0.009849 -0.009849 -0.197533 -0.197533 0.058531 0.058531 -0.089446 -0.089446
polarizability: 5.28017526e+02 9.62535021e+00 1.97552712e+02 4.32236695e-04 1.90911818e-04 7.56199992e+01
1716.lowfreq: -3.9115 -1.4393 -0.0019 -0.0009 0.0006 2.0002 29.4785 30.7386 39.6793
frequency: 29.4785 30.7386 39.6792 62.5572 88.1801 124.4962 157.1108 196.1358 205.0851 225.3290 273.9777 307.5560 320.6091 345.4302 381.4071 385.9387 439.4126 443.7165 457.5915 482.7287 581.2549 582.3913 599.4079 615.3041 618.0304 618.1155 658.6773 676.7406 678.4650 711.0310 711.4313 773.2952 823.1896 823.5303 832.5879 905.0980 911.1620 911.2606 952.4623 952.4757 956.9398 1000.7931 1000.9008 1001.3672 1001.3827 1030.0088 1030.1034 1108.6463 1110.3198 1178.5473 1191.6185 1211.0789 1222.8938 1282.2265 1311.4978 1312.8133 1335.1103 1336.4157 1361.1334 1383.2780 1398.7591 1400.7950 1439.6889 1446.0303 1490.2496 1502.2621 1541.0416 1541.7118 1578.0442 1579.9744 3112.6723 3112.7595 3139.8608 3139.8694 3159.0322 3159.0704 3177.3264 3177.3630
redmass: 5.2675 6.1145 7.0352 6.8159 6.3320 6.9233 5.1012 15.1159 7.6261 4.9510 7.1216 10.7489 5.4285 9.0590 3.0436 3.3466 28.6384 5.7967 13.2534 5.7156 9.9433 7.1487 9.5455 8.8158 10.3777 8.5591 8.9388 8.2745 11.6167 1.8826 1.8867 11.2650 1.6112 1.6165 10.1143 9.6013 1.4670 1.4660 1.4676 1.4672 11.2501 3.9483 3.9748 1.3755 1.3761 2.9488 2.8508 1.7059 1.6484 2.2467 1.6483 1.6981 2.5190 9.0079 11.6099 10.5888 1.3992 1.3212 4.3662 8.3411 2.1969 2.1599 2.3901 2.3208 5.1041 6.6639 5.3980 5.4822 5.8152 5.8404 1.0909 1.0909 1.0888 1.0888 1.0923 1.0923 1.0998 1.0998
irintensity: 3.8092 1.4265 0.0000 1.2445 0.0000 0.0000 0.0163 2.6953 0.0000 0.0000 15.7099 2.5296 2.0199 0.0000 0.0000 3.7559 0.0000 0.0000 1.3018 0.0470 0.0000 0.0000 8.6278 0.0000 13.0127 2.0968 0.0000 34.8327 0.0002 0.0001 74.3491 0.0000 78.7389 0.0000 15.6070 0.0000 0.0000 5.3285 0.0258 2.7395 38.6903 0.0008 35.0416 1.8790 0.0006 10.9229 0.0002 27.8590 0.0000 17.1850 0.0000 14.5121 0.0000 0.0000 9.1554 0.0000 37.4051 0.0000 21.5463 0.0000 0.0000 72.1279 0.0000 117.7202 0.0000 15.7185 0.0001 18.2467 0.0000 6.1437 39.4222 0.0003 5.9718 1.0261 36.7166 0.0203 35.3115 0.0016
temp: 298.150 k
press: 1.00000 atm
elementType: 16 16 7 7 7 7 6 6 6 6 6 6 6 6 6 6 6 6 6 6 1 1 1 1 1 1 1 1
symmnumber: 1
zpe: 498822.8 jmol-1
zpe.correction: 0.189992 hartree
zpe.thermalcorrener: 0.205858 hartree
zpe.thermalcorrenthalpy: 0.206803 hartree
zpe.thermalcorrgfe: 0.144234 hartree
zpe.sumelectzpe: -1552.042507 hartree
zpe.sumelectthermal: -1552.026640 hartree
zpe.sumelectthermalent: -1552.025696 hartree
zpe.sumelectthermalfe: -1552.088265 hartree
dipole: 0.0000 0.0000 0.0024
dipole: 0.0024
quadrupole: -122.0472 -128.0506 -133.5273
quadrupole: 26.9034 -0.0013 -0.0005
quadrupole: 5.8279 -0.1756 -5.6523 26.9034 -0.0013 -0.0005
hfenergy: -1552.2324988 hartree
pointgroup: C01 [X(C14H8N4S2)]
dipole: -0.0000021 -0.0000024 0.000937 debye
polarizability: 528.2542281|3.7907121|197.3160094|0.0004355|0.0001833|75.6199992 unknown
InChI: InChI=1S/C14H8N4S2/c1-3-9(7-15-5-1)11-17-13-14(19-11)18-12(20-13)10-4-2-6-16-8-10/h1-8H
charge 0 multiplicity 1
28 atoms
S  -1.332565 1.677094 0.046426
S  1.33198 -1.677082 0.04627
N  1.48717 1.032567 0.046612
N  -1.487755 -1.032558 0.046503
N  -5.879706 1.210938 0.045949
N  5.879119 -1.210933 0.046059
C  0.16271 0.686551 0.04645
C  -0.163295 -0.686541 0.046383
C  -2.2684 0.052926 0.046359
C  2.267814 -0.052917 0.046368
C  -3.72775 0.025933 0.046529
C  3.727165 -0.025925 0.046549
C  -4.410147 -1.225089 0.04726
C  4.409562 1.225096 0.047202
C  -4.519391 1.210196 0.045991
C  4.518803 -1.210189 0.046107
C  -5.816939 -1.235063 0.047295
C  5.816355 1.235068 0.047242
C  -6.512016 -0.001367 0.046597
C  6.511429 0.001371 0.046618
H  -3.825198 -2.149573 0.047762
H  3.824614 2.149581 0.047641
H  -4.048239 2.201658 0.045605
H  4.047651 -2.201651 0.045811
H  -6.37221 -2.177897 0.047881
H  6.371627 2.177901 0.04777
H  -7.606987 0.031721 0.046373
H  7.606401 -0.031717 0.046386
