program: Gaussian 09
title: 000022240
version: EM64L-G09RevD.01
frameworkgroup: C1[X(C15H20O4)]
method: RPBEPBE
basis: SDD
operation: Freq
keyword: #pfreq=noraman
keyword: PBEPBE/SDD
title: #p freq=noraman PBEPBE/SDD
converged: NO YES NO NO
title: Mulliken charges:
elementType: O O O O C C C C C C C C C C C C C C C H H H H H H H H H H H H H H H H H H H H
charge: -0.220770 -0.469539 -0.451438 -0.197882 0.426846 -0.236088 -0.561393 -0.246428 -0.153042 -0.457466 -0.487962 0.604732 -0.098957 -0.457894 -0.807552 0.306568 -0.812475 0.081430 -0.690987 0.223116 0.235142 0.235828 0.231445 0.269617 0.269857 0.211842 0.213795 0.226414 0.212943 0.232393 0.219539 0.228660 0.244979 0.350404 0.240570 0.228792 0.352937 0.240615 0.261409
chargesum: 0.00000
title: Mulliken charges with hydrogens summed into heavy atoms:
elementType: O O O O C C C C C C C C C C C C C C C
charge: -0.220770 -0.119135 -0.098501 -0.197882 0.426846 -0.012972 -0.090424 -0.014983 0.116575 -0.187609 -0.062324 0.604732 0.127457 -0.012558 -0.114373 0.306568 -0.343113 0.081430 -0.188963
polarizability: 1.76557311e+02 1.54467742e+00 1.72487832e+02 1.01937062e+01 -9.60324225e-01 1.44406328e+02
1716.lowfreq: -15.9245 0.0007 0.0009 0.0009 4.2947 18.5789 53.2151 61.1622 85.1926
frequency: 53.2072 61.0886 85.1867 102.3786 126.6918 143.7777 171.4621 189.8751 205.3636 249.4776 264.6185 285.0112 291.5154 303.1451 305.1994 315.3176 326.4362 339.9415 378.9197 395.3430 416.4773 428.8610 472.8905 479.9818 500.4468 521.8823 541.9739 572.6493 582.6860 597.9829 657.8810 682.1903 699.6122 717.8581 757.1889 789.4947 790.8629 834.1961 844.0627 863.0772 888.9634 901.4822 925.0122 945.5752 954.5252 960.9969 975.6309 981.2482 990.3858 993.6719 1005.7487 1015.9788 1020.0683 1034.5033 1075.3635 1102.2120 1116.4660 1129.1117 1133.5155 1156.0355 1169.9732 1193.7842 1210.7238 1226.7767 1237.2966 1247.2732 1259.2359 1264.5092 1275.4449 1287.2260 1293.5156 1306.0423 1319.6954 1325.4013 1327.3149 1337.5568 1355.5106 1361.0168 1379.6476 1389.6212 1391.8672 1409.0351 1436.3874 1463.0537 1468.7619 1474.5976 1484.7850 1498.1502 1657.2599 1673.7376 1687.3064 2911.2940 2937.8587 2965.6006 2972.0609 2977.9177 2990.9955 2995.1894 2995.6699 3036.4629 3044.8784 3066.8487 3084.3469 3090.1635 3093.9723 3097.1184 3099.5790 3202.9302 3208.8701 3520.2260 3585.3685
redmass: 5.3456 4.4223 5.3515 3.6166 3.2973 2.9292 2.5217 1.7257 3.2756 3.9071 3.5438 3.2709 2.8902 2.0696 2.5722 2.2816 3.0396 2.8679 3.3870 3.8673 3.6942 2.6068 2.2759 4.0440 1.5765 3.3129 2.9663 2.8434 4.2037 2.5591 3.5983 3.0358 2.1432 2.2171 2.1475 3.0117 1.9269 2.6224 2.1439 2.3232 1.9047 3.6179 3.6738 1.4101 2.0826 2.0867 2.4147 1.9700 1.8603 1.8520 1.9933 3.0289 3.4141 2.0853 1.7985 1.8693 1.8243 1.9838 2.0482 2.0094 2.1212 1.3897 2.1357 1.5782 1.4883 1.2868 1.4530 1.4362 1.3288 1.4945 1.6032 1.6026 1.5108 1.4981 1.2787 1.3388 1.7101 1.3910 1.4545 1.6495 1.2301 1.1659 1.1859 1.0784 1.0715 1.0887 1.0680 1.0637 5.2562 6.7412 12.0642 1.0802 1.0824 1.0835 1.0609 1.0827 1.0568 1.0386 1.0650 1.0996 1.0995 1.1010 1.0971 1.0975 1.0928 1.0613 1.0637 1.1121 1.1158 1.0648 1.0665
irintensity: 0.4649 2.6426 3.7571 2.3837 0.3668 0.5890 0.9418 4.2544 1.6845 18.9013 9.8495 2.4293 6.7115 58.0428 13.9728 39.5327 8.4302 1.7692 5.3267 1.6000 0.7299 2.1028 81.3203 8.2109 90.7683 17.7479 0.9639 6.5601 2.4451 11.7541 2.7329 0.8531 2.0619 0.9124 0.8774 7.8998 1.5440 4.0019 1.8715 5.4098 18.7814 39.3741 87.9423 68.1424 26.3036 13.9760 20.1360 9.6068 19.4444 123.3154 15.6231 60.0385 114.9282 36.8468 33.4233 19.8907 1.6209 2.2591 8.2234 7.1771 8.1189 5.5187 52.2627 9.7726 10.7308 13.4073 18.5826 19.4125 1.0969 9.2388 7.1710 10.1930 13.8707 9.4631 0.0505 26.9447 0.9755 6.4138 0.8398 19.8902 21.0642 30.5504 13.2229 3.9972 5.8921 8.8493 10.6014 4.0712 29.5354 21.5977 297.5158 12.3364 15.3710 36.0676 28.7930 13.2809 20.2061 29.5699 27.2063 16.8471 36.9803 35.7893 35.0703 22.1652 22.0589 2.4193 6.3074 14.8372 1.2415 12.1856 10.8727
temp: 298.150 k
press: 1.00000 atm
elementType: 8 8 8 8 6 6 6 6 6 6 6 6 6 6 6 6 6 6 6 1 1 1 1 1 1 1 1 1 1 1 1 1 1 1 1 1 1 1 1
symmnumber: 1
zpe: 849005.1 jmol-1
zpe.correction: 0.323369 hartree
zpe.thermalcorrener: 0.341006 hartree
zpe.thermalcorrenthalpy: 0.341950 hartree
zpe.thermalcorrgfe: 0.279593 hartree
zpe.sumelectzpe: -883.007553 hartree
zpe.sumelectthermal: -882.989916 hartree
zpe.sumelectthermalent: -882.988971 hartree
zpe.sumelectthermalfe: -883.051329 hartree
dipole: 1.4912 2.7474 1.9120
dipole: 3.6643
quadrupole: -146.0698 -109.0013 -114.1935
quadrupole: -13.4646 -0.3228 -1.4296
quadrupole: -22.9816 14.0869 8.8947 -13.4646 -0.3228 -1.4296
hfenergy: -883.3309216 hartree
pointgroup: C01 [X(C15H20O4)]
dipole: 0.6028049 -1.0774979 -0.7443288 debye
polarizability: 176.5670511|-1.566148|172.4173495|-10.2262698|-1.3609541|144.4670697 unknown
InChI: InChI=1S/C15H20O4/c1-7-9-4-5-10(16)13(17)15(9,3)6-11-12(7)8(2)14(18)19-11/h9-13,16-17H,1-2,4-6H2,3H3
charge 0 multiplicity 1
39 atoms
O  -2.705681 1.57834 -0.573132
O  2.658096 2.321008 -0.280289
O  4.375617 0.773811 1.272735
O  -4.138764 1.385115 1.260957
C  0.987111 0.432493 -0.561458
C  0.614182 -0.947614 0.117418
C  -0.249336 1.372269 -0.447644
C  2.141832 1.053148 0.28566
C  -1.524949 0.800166 -1.091584
C  -1.822207 -0.677618 -0.682994
C  1.839702 -1.881798 0.254222
C  -0.588571 -1.564856 -0.590014
C  3.375928 0.14264 0.402947
C  2.993063 -1.203908 1.029478
C  1.40462 0.270428 -2.044157
C  -2.630909 -0.480685 0.598822
C  -0.610899 -2.816082 -1.119626
C  -3.265371 0.88024 0.534687
C  -2.834491 -1.338833 1.626329
H  0.286203 -0.689004 1.152154
H  -0.034917 2.352819 -0.913505
H  -0.460619 1.556252 0.625862
H  1.762574 1.239526 1.316679
H  -1.537478 0.940178 -2.182535
H  -2.512706 -1.104599 -1.438509
H  2.192065 -2.195315 -0.747824
H  1.539139 -2.805256 0.784363
H  3.805144 -0.004092 -0.611328
H  2.695437 -1.019479 2.080536
H  3.883105 -1.857379 1.057002
H  2.230471 -0.450499 -2.169042
H  0.564993 -0.090654 -2.662348
H  1.751007 1.240042 -2.442721
H  2.032076 3.058914 -0.075486
H  0.247627 -3.491639 -1.065777
H  -1.503339 -3.202729 -1.626577
H  4.498539 1.698506 0.92886
H  -2.367968 -2.329905 1.6468
H  -3.481427 -1.048252 2.46204
