program: Gaussian 09
title: 000234444
version: EM64L-G09RevD.01
frameworkgroup: C1[X(C19H14O4)]
method: RPBEPBE
basis: SDD
operation: Freq
keyword: #pfreq=noraman
keyword: PBEPBE/SDD
title: #p freq=noraman PBEPBE/SDD
converged: YES YES NO NO
title: Mulliken charges:
elementType: O O O O C C C C C C C C C C C C C C C C C C C H H H H H H H H H H H H H H
charge: -0.195823 -0.392643 -0.237332 -0.230204 -0.402553 0.166566 0.609519 -0.045268 0.148702 0.087462 -0.366906 -0.422766 -0.221065 -0.224633 -0.306701 -0.238297 -0.259873 0.466523 -0.374644 -0.383590 -0.237709 -0.238804 -0.231871 0.276255 0.230862 0.232094 0.227814 0.230190 0.266764 0.231245 0.265575 0.395652 0.236781 0.239278 0.231447 0.233317 0.234640
chargesum: 0.00000
title: Mulliken charges with hydrogens summed into heavy atoms:
elementType: O O O O C C C C C C C C C C C C C C C C C C C
charge: -0.195823 0.003008 -0.237332 -0.230204 -0.126298 0.166566 0.609519 -0.045268 0.148702 0.087462 -0.136044 -0.190672 0.006748 0.005557 -0.039937 -0.007052 0.005702 0.466523 -0.137862 -0.144312 -0.006263 -0.005487 0.002768
polarizability: 3.45054418e+02 4.71298018e+00 2.44358059e+02 -1.92408168e+01 2.90339360e+01 1.48752427e+02
1716.lowfreq: -6.6702 -4.0648 0.0008 0.0008 0.0010 2.4860 14.5013 20.0523 23.2814
frequency: 14.2253 20.0331 23.1904 44.3115 55.9354 69.7565 94.7982 100.0030 143.7593 153.6750 186.8970 218.9091 247.4132 268.0288 275.0254 280.2226 294.6006 335.4781 394.3171 400.9179 401.7633 456.7228 469.3325 493.9502 505.9211 562.3576 575.7424 606.6732 610.4451 614.2983 614.8613 640.7239 688.6093 698.0411 711.2156 725.3501 732.2583 773.1748 774.1670 802.6438 829.1273 837.5307 848.6997 848.9378 879.7885 901.3983 927.5826 932.0038 956.2785 976.0031 982.1316 988.1337 991.8325 997.9763 999.1683 1018.0066 1023.2634 1026.2665 1045.2514 1081.3047 1085.3079 1090.6705 1174.1588 1174.8751 1176.9785 1189.8806 1191.9265 1210.9110 1224.3648 1238.6375 1269.9815 1273.1714 1299.2620 1321.0207 1335.1209 1338.8976 1375.3367 1389.5110 1392.3905 1441.2156 1445.1181 1484.7835 1485.4843 1507.3066 1579.7469 1598.9644 1609.6114 1614.1097 1634.0361 1654.9340 1688.6990 3055.0269 3096.6705 3124.1379 3125.7574 3129.6193 3131.0664 3139.9829 3142.7703 3151.1811 3151.6776 3154.9869 3167.3687 3168.4883 3422.6836
redmass: 3.6819 6.2812 3.8725 6.8461 6.8650 6.3871 6.2644 8.8961 5.5535 3.5450 5.5493 7.1434 5.8727 6.2425 3.2201 5.6821 6.7618 7.1178 8.3257 2.8448 2.7535 7.0510 5.4400 3.2093 4.2123 6.9228 1.1052 7.3228 6.2220 6.4268 6.6524 5.7862 2.2216 1.7032 2.8958 8.6006 6.7583 2.3644 1.9758 5.4810 5.2960 4.6031 1.2726 1.2867 4.9638 1.8350 1.5030 1.4724 5.5127 1.4055 1.3887 6.1484 5.9247 1.3380 1.3203 1.2101 2.4030 2.2091 2.8088 2.3379 1.6083 2.3729 1.1638 1.0881 2.6818 1.1115 1.1258 1.8365 1.7190 1.5803 1.5639 1.9332 1.9015 1.7256 1.2884 1.2981 6.1849 7.2835 6.1083 2.3136 2.1637 2.3126 2.3184 10.8016 5.5396 6.1463 5.8889 6.0862 5.2522 11.8516 7.7479 1.0856 1.0896 1.0858 1.0865 1.0873 1.0871 1.0921 1.0918 1.0931 1.0965 1.0948 1.1016 1.1016 1.0644
irintensity: 0.1925 0.4728 0.0988 0.3293 0.9283 0.1194 0.1509 5.1069 2.6890 0.8705 0.7617 1.0480 2.7746 27.5168 2.2147 7.7373 1.8330 5.2007 0.5388 0.1819 0.0162 2.5151 1.1769 16.5048 10.4492 34.2908 128.5984 2.8643 21.2791 0.9932 1.0109 20.6193 40.4692 57.1564 9.0352 14.8749 28.7516 34.4716 64.8991 16.5273 4.8683 38.6438 0.4936 0.6413 23.0294 14.6505 2.9236 0.2021 4.9432 0.2095 0.3685 4.3002 3.3613 0.0704 4.6700 38.6489 1.4552 1.4513 18.5009 147.8088 11.4936 232.0317 19.6864 3.8932 155.3140 3.3423 21.4608 22.7943 14.1552 66.3188 63.1622 13.7317 61.9009 25.7544 15.2344 1.5275 40.6466 2.2254 62.4644 34.1279 11.1924 7.3621 18.0190 342.6907 17.6772 0.3300 16.3893 1.6159 377.7285 227.3549 298.2835 4.1632 1.3409 4.5244 3.9760 0.2470 0.5509 15.2216 10.3116 16.6846 31.2887 21.4398 23.0571 32.5897 128.6797
temp: 298.150 k
press: 1.00000 atm
elementType: 8 8 8 8 6 6 6 6 6 6 6 6 6 6 6 6 6 6 6 6 6 6 6 1 1 1 1 1 1 1 1 1 1 1 1 1 1
symmnumber: 1
zpe: 728694.8 jmol-1
zpe.correction: 0.277545 hartree
zpe.thermalcorrener: 0.297107 hartree
zpe.thermalcorrenthalpy: 0.298051 hartree
zpe.thermalcorrgfe: 0.225646 hartree
zpe.sumelectzpe: -1031.704592 hartree
zpe.sumelectthermal: -1031.685030 hartree
zpe.sumelectthermalent: -1031.684086 hartree
zpe.sumelectthermalfe: -1031.756491 hartree
dipole: -4.0203 -1.3203 1.3962
dipole: 4.4559
quadrupole: -119.4954 -131.3691 -128.2713
quadrupole: -15.3504 -2.2851 2.0049
quadrupole: 6.8832 -4.9905 -1.8927 -15.3504 -2.2851 2.0049
hfenergy: -1031.9821371 hartree
pointgroup: C01 [X(C19H14O4)]
dipole: 1.2618219 0.9567228 -0.752209 debye
polarizability: 296.8066781|71.6102189|241.9945884|-40.997622|40.9412778|199.3636378 unknown
InChI: InChI=1S/C19H14O4/c20-15(12-11-13-7-3-1-4-8-13)16-17(21)19(22)23-18(16)14-9-5-2-6-10-14/h1-12,18,21H
charge 0 multiplicity 1
37 atoms
O  -2.791441 -1.645276 2.180901
O  -0.583902 1.19167 2.596277
O  -3.093803 0.211589 3.603215
O  0.854495 -2.116841 -0.104302
C  -1.707048 -2.046292 1.180321
C  -0.672202 -0.926292 1.274241
C  -2.340859 -2.253374 -0.18372
C  -1.131652 0.007165 2.165692
C  -2.440739 -0.422743 2.744927
C  0.600365 -1.029445 0.523561
C  -2.972698 -1.179759 -0.858164
C  -2.309182 -3.533022 -0.784022
C  -3.571481 -1.388117 -2.118237
C  -2.902538 -3.741178 -2.048459
C  1.520689 0.127696 0.550086
C  -3.536806 -2.669772 -2.717272
C  2.707352 0.092058 -0.138266
C  3.723702 1.145299 -0.21453
C  3.603943 2.396323 0.462513
C  4.889956 0.910752 -1.000807
C  4.613849 3.370155 0.353119
C  5.901247 1.886716 -1.110426
C  5.766914 3.121179 -0.4333
H  -1.295551 -2.997758 1.559503
H  -3.00204 -0.184358 -0.39928
H  -1.806553 -4.360747 -0.270654
H  -4.063337 -0.555993 -2.633917
H  -2.86912 -4.733642 -2.510704
H  1.213502 0.999076 1.137425
H  -3.999351 -2.83037 -3.697481
H  2.914296 -0.834282 -0.695466
H  -1.196516 1.587797 3.280352
H  2.719626 2.602909 1.075007
H  4.993831 -0.046729 -1.525643
H  4.509001 4.325663 0.878683
H  6.789703 1.688345 -1.719446
H  6.55035 3.882596 -0.515327
