program: Gaussian 09
title: 000234442
version: EM64L-G09RevD.01
frameworkgroup: C1[X(C16H11ClN2O)]
method: RPBEPBE
basis: SDD
operation: Freq
keyword: #p
keyword: freq=noraman
keyword: PBEPBE/SDD
title: #p freq=noraman PBEPBE/SDD
converged: NO YES NO NO
title: Mulliken charges:
elementType: Cl O N N C C C C C C C C C C C C C C C C H H H H H H H H H H H
charge: -0.055945 -0.252284 -0.420195 -0.011352 0.355750 0.048791 0.017219 0.044107 -0.378268 -0.339616 -0.293297 0.579045 -0.208922 -0.281108 -0.231573 -0.317210 -0.370690 -0.236593 -0.249908 -0.225262 0.333907 0.234285 0.264641 0.267621 0.285640 0.234124 0.236779 0.239835 0.257633 0.235039 0.237806
chargesum: 0.00000
title: Mulliken charges with hydrogens summed into heavy atoms:
elementType: Cl O N N C C C C C C C C C C C C C C C C
charge: -0.055945 -0.252284 -0.086289 -0.011352 0.355750 0.048791 0.017219 0.044107 -0.143982 -0.074975 -0.025675 0.579045 0.025201 0.004532 0.005206 -0.317210 -0.130854 0.021040 -0.014870 0.012544
polarizability: 4.70045310e+02 4.12725724e+01 2.31676309e+02 9.83293414e-02 -7.45472241e-02 7.34285189e+01
1716.lowfreq: -7.6839 -4.0248 -0.0023 -0.0021 -0.0021 1.9472 14.2068 41.2371 42.5405
frequency: 14.0956 41.2196 42.4674 84.1266 112.0940 147.9674 154.8042 164.2429 173.0703 244.5217 279.9865 303.0949 319.1003 337.9443 378.3908 434.0059 448.6610 458.0369 460.0447 473.5274 494.0570 530.4293 558.7102 578.8838 586.0793 611.3464 667.5977 693.3741 707.8789 731.3790 736.2976 745.4125 761.7445 774.0184 794.1440 828.1340 865.1779 866.5660 890.0607 918.7659 925.7493 949.9462 951.6939 985.6301 986.6942 1014.7837 1019.0015 1022.1083 1040.1890 1107.1966 1119.8719 1121.6404 1168.1590 1171.7557 1215.9551 1229.5415 1251.3329 1264.6999 1283.6077 1291.4178 1302.9770 1334.0113 1375.3135 1383.1210 1406.1223 1427.4859 1452.5803 1466.2560 1473.8926 1497.6207 1562.2519 1573.3722 1599.3229 1612.4239 1619.9878 1632.0359 3126.2711 3131.7448 3138.1602 3145.9186 3147.3388 3152.6841 3160.7449 3165.1647 3177.0964 3177.8114 3504.2258
redmass: 7.6535 5.1420 7.4406 4.6786 7.0257 9.2843 4.6357 3.0523 8.2484 4.1538 3.6863 5.9194 7.7755 4.6992 10.9974 3.3824 7.9134 3.5508 6.2263 3.3816 7.0858 3.6410 3.7828 6.2059 7.9242 6.2373 6.9665 7.6214 2.2737 1.8443 5.7539 2.6705 1.3477 1.3623 4.5900 4.9747 1.5224 1.4005 4.8725 2.0500 5.6433 1.3755 1.3860 1.3241 1.3426 7.0235 1.1221 2.0921 2.0975 3.1013 1.9753 1.6874 1.0988 1.0816 1.5628 2.2735 2.2269 2.0777 1.8539 2.3373 1.3562 2.9418 3.1880 3.6432 3.6530 2.3725 3.1227 2.8709 2.7266 7.1463 5.6320 6.6887 6.5650 5.5834 6.0503 5.7416 1.0883 1.0920 1.0856 1.0892 1.0881 1.0893 1.0939 1.0953 1.0999 1.0998 1.0768
irintensity: 0.9475 2.6937 1.2914 0.6483 0.4486 0.4563 0.0027 0.1124 0.3300 2.6281 4.7381 1.5909 4.2148 0.0040 8.6269 4.7249 4.5582 12.5882 0.8861 3.5822 32.9184 0.0597 1.3287 8.5154 16.2535 2.2299 11.7559 2.8739 6.6667 0.0350 7.6735 0.3077 77.0378 197.5787 13.6818 1.1774 1.2280 0.0103 2.1689 1.9826 6.1453 4.6226 0.3810 0.0009 1.6310 45.9863 52.6819 8.0503 3.1692 25.0576 5.2448 9.0484 8.1727 6.0201 12.1605 4.1462 1.1706 6.7642 10.5717 3.9769 37.8197 22.2403 1.7076 24.6788 3.5600 33.6571 1.0544 53.0118 5.8165 106.6276 6.5921 22.2554 4.7008 88.7142 256.7257 142.7062 9.0176 0.2287 3.8283 7.4034 25.4749 0.0882 18.2473 14.8486 25.9740 20.3838 40.4035
temp: 298.150 k
press: 1.00000 atm
elementType: 17 8 7 7 6 6 6 6 6 6 6 6 6 6 6 6 6 6 6 6 1 1 1 1 1 1 1 1 1 1 1
symmnumber: 1
zpe: 599797.8 jmol-1
zpe.correction: 0.228451 hartree
zpe.thermalcorrener: 0.244584 hartree
zpe.thermalcorrenthalpy: 0.245528 hartree
zpe.thermalcorrgfe: 0.182533 hartree
zpe.sumelectzpe: -1259.740715 hartree
zpe.sumelectthermal: -1259.724582 hartree
zpe.sumelectthermalent: -1259.723638 hartree
zpe.sumelectthermalfe: -1259.786633 hartree
dipole: -1.8943 -0.1282 -0.0054
dipole: 1.8987
quadrupole: -76.6203 -123.9786 -128.4976
quadrupole: 5.6489 0.0827 -0.0035
quadrupole: 33.0785 -14.2798 -18.7988 5.6489 0.0827 -0.0035
hfenergy: -1259.9691658 hartree
pointgroup: C01 [X(C16H11Cl1N2O1)]
dipole: 0.7467621 0.012923 0.0130486 debye
polarizability: 474.7730125|-17.4753663|201.8722708|16.5542121|-56.529813|98.5048544 unknown
InChI: InChI=1S/C16H11ClN2O/c17-12-6-2-1-5-11(12)9-10-15-16(20)19-14-8-4-3-7-13(14)18-15/h1-10,19H
charge 0 multiplicity 1
31 atoms
Cl -3.062645 -2.85234 1.010895
O  1.01542 2.798436 -1.376732
N  2.919609 1.583565 -0.800453
N  1.323774 -0.551899 0.080016
C  3.559588 0.446495 -0.293535
C  2.715897 -0.630072 0.148887
C  0.743706 0.551713 -0.410699
C  1.525323 1.738042 -0.903916
C  4.969562 0.340929 -0.211648
C  3.324563 -1.805833 0.670689
C  -0.708961 0.672652 -0.495747
C  -3.032237 -0.260914 -0.136129
C  5.543036 -0.834011 0.30919
C  -1.568667 -0.314235 -0.08163
C  4.722383 -1.909581 0.75126
C  -3.839781 -1.342208 0.325876
C  -3.739755 0.870734 -0.652632
C  -5.246036 -1.32033 0.28755
C  -5.143273 0.914329 -0.700877
C  -5.904628 -0.183429 -0.229809
H  3.47722 2.379001 -1.129365
H  5.604905 1.167572 -0.551474
H  2.663966 -2.61282 1.001419
H  -1.056466 1.621671 -0.918399
H  -1.11738 -1.226025 0.328284
H  6.633048 -0.918903 0.373669
H  5.184085 -2.816571 1.153762
H  -3.16481 1.726274 -1.020676
H  -5.814731 -2.178419 0.656694
H  -5.647281 1.798791 -1.103941
H  -6.998733 -0.158912 -0.263128
