program: Gaussian 09
title: 000234214
version: EM64L-G09RevD.01
frameworkgroup: C1[X(C13H18ClNO2)]
method: RPBEPBE
basis: SDD
operation: Freq
keyword: #p
keyword: freq=noraman
keyword: PBEPBE/SDD
title: #p freq=noraman PBEPBE/SDD
converged: YES YES NO NO
title: Mulliken charges:
elementType: Cl O O N C C C C C C C C C C C C C H H H H H H H H H H H H H H H H H H
charge: -0.071417 -0.426993 -0.232102 -0.167081 0.450415 -0.390467 -0.395117 0.492551 -0.557378 -0.370101 -0.364947 -0.437461 -0.427767 -0.461209 -0.583181 -0.662087 0.204781 0.245767 0.245541 0.225585 0.220115 0.237898 0.212246 0.225497 0.227014 0.239350 0.225398 0.236138 0.247956 0.264891 0.292857 0.219078 0.241087 0.215606 0.377534
chargesum: 0.00000
title: Mulliken charges with hydrogens summed into heavy atoms:
elementType: Cl O O N C C C C C C C C C C C C C
charge: -0.071417 -0.049459 -0.232102 -0.167081 0.450415 0.100841 0.050584 0.492551 -0.107233 -0.144604 -0.137933 -0.198110 -0.202369 0.022885 -0.025433 0.013685 0.204781
polarizability: 2.24051026e+02 -5.53998276e+00 1.60739085e+02 1.31110813e+01 1.58308452e+01 1.21424212e+02
1716.lowfreq: -15.0529 -5.3160 -0.8496 0.0003 0.0016 0.0022 10.1624 28.8913 36.0295
frequency: 6.9258 28.6525 35.9905 36.2800 49.5863 57.4052 84.5394 109.4152 131.2985 148.4834 201.2620 221.7363 222.7700 259.2365 269.0961 330.1091 362.7609 387.2323 403.6691 418.4252 449.2891 496.8669 515.5368 527.7255 545.3459 586.5725 637.7427 647.8780 658.5172 689.0611 728.5963 768.4896 776.3014 785.5430 791.1067 807.2581 812.8190 894.0453 914.1163 930.9508 946.3466 951.7456 991.8220 999.8754 1017.4220 1022.6056 1036.3285 1065.9639 1076.0301 1105.0001 1137.0466 1168.6842 1184.2489 1197.4399 1207.6273 1213.9567 1233.3405 1253.3777 1269.0812 1289.7203 1289.8853 1314.1044 1332.8711 1342.0730 1343.4889 1353.2655 1376.7425 1384.9448 1390.7926 1430.1370 1439.2375 1458.4312 1466.1359 1470.1068 1477.7003 1487.9475 1503.1321 1521.4254 1569.1023 1632.5927 1666.7082 2983.2219 2987.7823 2992.7196 3000.5941 3011.1859 3041.2950 3062.2296 3063.6728 3067.6195 3078.7804 3088.8799 3093.1000 3109.8094 3123.5827 3147.7529 3151.3541 3161.6462 3514.1807
redmass: 6.8735 6.7743 6.6536 7.8253 5.0833 3.5934 3.0188 3.8524 2.6231 3.5459 1.1883 5.3285 4.3406 3.1286 2.7000 3.1193 2.7967 2.6368 3.5585 2.9464 2.9871 2.7658 3.8143 3.7346 2.5541 1.6120 6.5234 3.2308 2.2987 3.9304 3.2395 3.8025 1.7771 1.4960 1.3490 1.2649 1.7467 2.3341 1.8187 1.7958 1.9349 1.3746 2.6123 2.8861 1.6133 2.6554 4.2351 1.7545 1.9909 1.5340 1.5027 1.7890 1.2415 1.3308 1.1306 2.1737 1.8260 1.1712 1.3854 1.2150 2.1759 1.3409 1.3176 1.5492 1.3300 1.3499 4.2979 1.2464 1.9193 3.1160 1.0874 1.0991 1.0448 1.1045 1.0587 1.0777 1.1390 2.5974 6.4957 6.3440 8.5208 1.0357 1.0635 1.0604 1.0645 1.0604 1.1025 1.0610 1.0989 1.0995 1.0997 1.0965 1.1008 1.0887 1.0889 1.1105 1.0942 1.0936 1.0639
irintensity: 0.3002 0.5090 1.1802 0.2404 0.4608 0.2755 0.2439 0.5105 0.9205 0.5553 1.2155 3.8126 6.8068 1.9432 1.0995 3.2716 1.7078 2.9089 4.2572 2.2061 13.7306 3.9203 34.6467 10.8339 16.2261 80.3140 3.6699 80.8410 51.5335 73.4694 1.1044 1.0878 6.8590 2.6187 7.8997 2.3767 67.8781 0.4277 37.7530 35.5306 4.7731 0.9179 20.6678 0.9338 7.9998 5.6615 1.4349 134.3172 11.6847 31.9872 5.2847 39.2399 28.0064 6.6005 14.1885 48.3783 0.7453 26.3585 46.3686 11.1997 23.0179 0.5197 1.1141 27.0994 11.9015 45.0812 4.6420 22.1719 65.5491 4.1804 15.5282 11.7317 9.2468 8.4836 2.4677 25.6256 3.3056 250.7488 5.0206 141.9124 227.4202 27.9968 17.4110 44.6254 55.8627 22.8877 10.1634 14.9426 4.3400 13.0570 43.4964 17.6822 41.2832 19.7172 18.4014 12.1127 26.5903 14.8637 21.4431
temp: 298.150 k
press: 1.00000 atm
elementType: 17 8 8 7 6 6 6 6 6 6 6 6 6 6 6 6 6 1 1 1 1 1 1 1 1 1 1 1 1 1 1 1 1 1 1
symmnumber: 1
zpe: 753806.1 jmol-1
zpe.correction: 0.287110 hartree
zpe.thermalcorrener: 0.305319 hartree
zpe.thermalcorrenthalpy: 0.306263 hartree
zpe.thermalcorrgfe: 0.236118 hartree
zpe.sumelectzpe: -1170.151731 hartree
zpe.sumelectthermal: -1170.133521 hartree
zpe.sumelectthermalent: -1170.132577 hartree
zpe.sumelectthermalfe: -1170.202722 hartree
dipole: -0.3925 3.2552 -0.5158
dipole: 3.3191
quadrupole: -110.1432 -107.9423 -110.8637
quadrupole: 7.2168 6.6186 11.6959
quadrupole: -0.4934 1.7074 -1.2140 7.2168 6.6186 11.6959
hfenergy: -1170.4388401 hartree
pointgroup: C01 [X(C13H18Cl1N1O2)]
dipole: -0.0686976 1.2580813 -0.3430401 debye
polarizability: 222.8994525|-8.0682304|164.4986459|15.6266439|10.1569587|118.816225 unknown
InChI: InChI=1S/C13H18ClNO2/c1-2-15(10-9-14)12-6-3-11(4-7-12)5-8-13(16)17/h3-4,6-7,16H,2,5,8-10H2,1H3
charge 0 multiplicity 1
35 atoms
Cl 4.935782 -2.672482 0.5907
O  -4.456925 0.833354 0.850476
O  -3.849247 -0.995193 2.141403
N  2.438033 0.610146 0.097862
C  1.098615 0.375221 -0.278373
C  3.491787 -0.377205 -0.173511
C  2.856788 1.88999 0.705835
C  -1.653284 -0.111115 -1.032475
C  -3.104557 -0.379534 -1.403059
C  0.094996 1.381655 -0.128717
C  0.685214 -0.880881 -0.824097
C  -1.243048 1.133119 -0.493795
C  -0.655099 -1.105083 -1.191325
C  -3.87446 -1.202236 -0.326938
C  3.580535 -1.403567 0.972227
C  3.156988 3.001691 -0.327846
C  -4.028772 -0.49927 1.008225
H  3.314534 -0.897561 -1.131771
H  4.462453 0.141162 -0.271484
H  2.083519 2.228506 1.420312
H  3.765033 1.697714 1.307366
H  -3.640011 0.571982 -1.565043
H  -3.155851 -0.950641 -2.350166
H  0.353122 2.370079 0.26196
H  1.40412 -1.694294 -0.963121
H  -1.986694 1.928582 -0.362136
H  -0.927808 -2.082219 -1.611672
H  -4.894038 -1.42379 -0.702042
H  -3.372601 -2.163793 -0.128421
H  3.86869 -0.937825 1.926457
H  2.65284 -1.981175 1.091298
H  3.970694 2.693508 -1.009159
H  2.268107 3.225737 -0.942552
H  3.470675 3.931284 0.182952
H  -4.563829 1.241332 1.752333
