program: Gaussian 09
title: 000234213
version: EM64L-G09RevD.01
frameworkgroup: C1[X(C12H17NO2)]
method: RPBEPBE
basis: SDD
operation: Freq
keyword: #p
keyword: freq=noraman
keyword: PBEPBE/SDD
title: #p freq=noraman PBEPBE/SDD
converged: YES YES NO NO
title: Mulliken charges:
elementType: O O N C C C C C C C C C C C C H H H H H H H H H H H H H H H H H
charge: -0.267477 -0.244393 -0.421150 -0.572554 0.505013 -0.495600 0.451397 -0.416844 -0.397030 -0.378682 -0.426225 -0.316504 0.252789 -0.726395 -0.506447 0.237289 0.215691 0.250958 0.254979 0.224664 0.228898 0.234133 0.209827 0.292771 0.212963 0.212881 0.221410 0.221842 0.228675 0.241228 0.232172 0.239721
chargesum: 0.00000
title: Mulliken charges with hydrogens summed into heavy atoms:
elementType: O O N C C C C C C C C C C C C
charge: -0.267477 -0.244393 -0.128378 -0.119574 0.505013 0.010337 0.451397 -0.192180 -0.168132 -0.144548 -0.216398 0.109340 0.252789 -0.054468 0.206673
polarizability: 2.25544025e+02 -5.19159814e+00 1.24971171e+02 -1.03070204e+01 -1.03116234e+01 9.88368062e+01
1716.lowfreq: -6.3528 -3.2353 -0.0009 -0.0009 0.0004 4.0984 14.5384 22.7562 31.7497
frequency: 11.6985 22.6669 31.7243 47.4844 64.9008 86.6664 90.4501 130.7606 140.9301 179.4708 198.6769 251.0294 264.9042 295.3590 308.9149 320.4510 357.3360 410.1804 423.6590 430.7857 522.1129 559.5191 577.6470 636.7772 666.3762 726.2062 761.0399 783.8628 804.1551 815.5283 822.8426 826.2855 861.3710 931.4975 933.0681 951.5993 954.4368 998.5455 1000.8343 1040.3743 1070.4693 1104.6585 1111.9620 1127.1635 1146.7041 1148.0800 1165.0357 1167.8282 1192.9304 1223.8138 1261.1156 1262.2867 1284.2761 1288.7064 1324.2395 1343.8815 1355.5386 1377.9318 1395.6567 1420.9822 1421.2909 1444.4515 1452.1152 1464.3507 1471.2470 1476.7554 1479.5959 1485.1044 1505.3017 1527.7814 1582.1132 1637.3952 1643.6198 2928.6257 2963.3153 2983.3876 2989.9621 3000.3592 3002.8666 3051.2553 3075.9547 3078.7506 3093.5034 3102.6019 3103.5252 3110.4677 3128.1089 3146.8297 3154.6950 3571.4194
redmass: 4.7090 4.0316 3.8091 2.5012 2.8175 1.8779 1.2304 3.6685 3.7031 4.7311 3.4385 1.2148 3.6890 1.0874 2.5912 4.2121 4.3466 2.9765 3.6890 3.7273 2.4776 4.9110 2.9446 6.6815 4.6493 3.4750 2.3228 1.7815 1.2572 1.5881 4.1605 1.2472 4.2568 1.6071 2.0256 1.3800 3.6157 2.0930 2.4099 4.5183 2.5988 1.7642 1.2741 1.7714 1.4438 1.4901 2.0551 1.6105 1.1247 2.2118 1.2586 1.1147 1.4657 1.6837 1.4104 1.5497 1.7600 2.6877 1.2489 3.0745 1.2383 1.0872 1.0502 1.0508 1.5351 1.0409 1.0967 1.1394 1.1162 3.0364 5.0458 6.5073 9.1881 1.0573 1.1042 1.0363 1.0644 1.0604 1.0304 1.0984 1.1006 1.0985 1.0986 1.0864 1.1044 1.0890 1.0964 1.1047 1.0938 1.0770
irintensity: 1.5930 0.2307 0.3377 0.3503 1.6697 8.4836 2.4772 0.8280 1.4382 0.6080 9.7836 16.4514 10.6841 69.6611 2.2104 17.2952 2.4802 0.1585 2.3322 0.4949 26.0746 11.0185 8.0704 0.2048 1.9767 0.1758 3.2279 6.1280 25.0717 62.1442 2.3758 6.8983 3.2108 2.9734 0.3868 0.3882 11.6845 1.8942 1.5712 22.4918 1.4177 117.5715 1.0614 87.2145 9.7480 1.7729 74.5769 79.9696 17.9516 0.1392 21.8769 0.4467 60.1843 13.4922 31.3600 56.0343 27.3930 54.4939 32.9612 12.6280 15.9269 17.5701 13.8306 12.0383 35.6018 12.6972 19.1848 6.5273 70.7715 214.7472 4.8925 166.4436 166.0812 66.7099 43.5965 34.7738 3.4663 28.2484 40.5237 3.9562 45.9572 15.3519 33.5992 18.5682 28.0950 28.0498 26.9120 17.4978 18.6523 34.2031
temp: 298.150 k
press: 1.00000 atm
elementType: 8 8 7 6 6 6 6 6 6 6 6 6 6 6 6 1 1 1 1 1 1 1 1 1 1 1 1 1 1 1 1 1
symmnumber: 1
zpe: 700366.5 jmol-1
zpe.correction: 0.266756 hartree
zpe.thermalcorrener: 0.283456 hartree
zpe.thermalcorrenthalpy: 0.284400 hartree
zpe.thermalcorrgfe: 0.218631 hartree
zpe.sumelectzpe: -671.537740 hartree
zpe.sumelectthermal: -671.521039 hartree
zpe.sumelectthermalent: -671.520095 hartree
zpe.sumelectthermalfe: -671.585864 hartree
dipole: 2.6710 -1.4674 -1.3743
dipole: 3.3431
quadrupole: -64.4301 -89.1318 -91.5334
quadrupole: 7.4323 1.2129 -6.6342
quadrupole: 17.2683 -7.4334 -9.8349 7.4323 1.2129 -6.6342
hfenergy: -671.8044951 hartree
pointgroup: C01 [X(C12H17N1O2)]
dipole: 1.0493026 -0.6371347 -0.4721952 debye
polarizability: 225.5777408|-6.9424542|122.7615006|-8.8960564|-12.6825264|101.0127611 unknown
InChI: InChI=1S/C12H17NO2/c1-3-13-11-7-4-10(5-8-11)6-9-12(14)15-2/h4-5,7-8,13H,3,6,9H2,1-2H3
charge 0 multiplicity 1
32 atoms
O  -4.657189 -1.063043 -0.614167
O  -4.496962 1.074644 0.295144
N  4.063024 0.142446 -0.403038
C  -1.605972 0.603162 0.722184
C  -0.112712 0.491834 0.455838
C  -2.443937 -0.160382 -0.340284
C  2.700272 0.242071 -0.116123
C  0.658785 -0.567002 0.994532
C  0.556689 1.428406 -0.37698
C  2.036809 -0.701767 0.7231
C  1.929296 1.313904 -0.660968
C  4.935819 -0.916502 0.1090
C  -3.937231 0.053323 -0.166051
C  6.375939 -0.722545 -0.394948
C  -6.133897 -0.944224 -0.538695
H  -1.929445 1.659936 0.722548
H  -1.849346 0.198112 1.722782
H  -2.168092 0.203484 -1.350528
H  -2.224317 -1.24161 -0.328797
H  0.174229 -1.303498 1.649159
H  -0.007478 2.268432 -0.802875
H  2.594463 -1.532472 1.166648
H  2.41948 2.058209 -1.302334
H  4.480892 0.851495 -1.004296
H  4.928968 -0.916735 1.220789
H  4.560621 -1.912683 -0.212105
H  6.418108 -0.754111 -1.499574
H  6.787488 0.246554 -0.056717
H  7.030792 -1.522081 -0.00803
H  -6.452335 -0.78796 0.50581
H  -6.513033 -1.898298 -0.930954
H  -6.48203 -0.0952 -1.151069
