program: Gaussian 09
title: 000022231
version: EM64L-G09RevD.01
frameworkgroup: C1[X(C19H14N2)]
method: RPBEPBE
basis: SDD
operation: Freq
keyword: #pfreq=noraman
keyword: PBEPBE/SDD
title: #p freq=noraman PBEPBE/SDD
converged: YES YES NO NO
title: Mulliken charges:
elementType: N N C C C C C C C C C C C C C C C C C C C H H H H H H H H H H H H H H
charge: -0.045488 -0.684073 0.299710 0.261149 -0.111074 0.276531 0.249464 -0.508160 -0.107389 -0.312982 -0.376842 0.246913 -0.355386 -0.315090 -0.283002 -0.236230 -0.384474 -0.384483 -0.222171 -0.222171 -0.240759 0.205558 0.264739 0.248681 0.187993 0.264980 0.329215 0.322631 0.226558 0.229981 0.245990 0.245989 0.227247 0.227246 0.229196
chargesum: 0.00000
title: Mulliken charges with hydrogens summed into heavy atoms:
elementType: N N C C C C C C C C C C C C C C C C C C C
charge: -0.045488 -0.032227 0.299710 0.261149 -0.111074 0.276531 0.249464 -0.302601 -0.107389 -0.048242 -0.128162 0.246913 -0.167392 -0.050110 -0.056444 -0.006249 -0.138484 -0.138494 0.005076 0.005075 -0.011563
polarizability: 4.05311005e+02 -4.03092657e+00 1.96625832e+02 1.00701349e-03 7.16955513e-03 1.25168807e+02
1716.lowfreq: -52.4928 -1.9903 -0.0007 -0.0005 -0.0001 3.9520 13.0238 32.1781 56.3451
frequency: -52.4620 31.6932 56.3428 80.5922 105.0839 133.9419 199.9282 219.2597 224.8818 285.5526 302.0550 348.8167 359.0662 396.6413 397.8508 414.3277 423.2165 441.0840 450.7523 495.6192 519.7006 545.7255 547.2842 563.2151 595.0117 607.6168 617.2059 637.7622 672.1665 684.4509 706.6592 727.0250 746.7503 756.4557 772.2394 798.4767 830.5386 843.9422 852.9233 855.0385 861.2778 873.2855 911.8347 922.7162 946.9712 973.9062 981.6163 987.6952 991.4909 994.8570 1013.6644 1019.8169 1043.1477 1076.2815 1102.7062 1115.1026 1122.4457 1155.3302 1171.6547 1172.5162 1185.8443 1231.5427 1250.0425 1276.7461 1286.2035 1299.2104 1307.7310 1344.9944 1367.2728 1378.8138 1399.6893 1427.4302 1430.4656 1451.0465 1461.8947 1484.7949 1493.8069 1517.3434 1545.2201 1556.4222 1582.1984 1610.4056 1617.4820 1633.1435 1652.3532 3102.8854 3108.2309 3122.0197 3127.8009 3133.6453 3136.4945 3140.3653 3148.8216 3153.1987 3163.9919 3165.5174 3169.1939 3577.4654 3710.4017
redmass: 3.8787 5.1273 5.1428 4.1032 4.0549 3.7739 4.8405 6.5298 4.9975 5.0972 4.3582 3.6584 1.1541 4.0301 2.8453 3.4764 6.4363 1.3433 5.4178 2.1959 5.6458 3.8757 3.9449 4.9349 3.6500 7.0545 5.4508 6.1129 4.9165 6.0168 1.7444 4.7248 3.2547 1.4677 2.0733 2.3550 3.5890 1.6139 1.2519 5.9309 1.6471 2.0368 3.0770 1.6911 1.3684 1.3831 1.3328 6.0555 1.3277 1.3150 3.1599 2.3582 1.9262 1.6027 3.2460 2.1532 1.5857 1.3453 1.0533 1.2612 1.1146 1.4531 2.3648 2.5034 1.8993 4.4011 1.3777 2.0164 6.6634 4.6300 4.2102 2.2038 3.2064 2.6479 3.4781 3.8062 3.3640 6.3025 6.9776 6.8542 5.9864 6.1855 6.1147 5.9093 1.2527 1.0871 1.0899 1.0844 1.0877 1.0877 1.0883 1.0925 1.0969 1.0941 1.1017 1.0970 1.0994 1.0452 1.1028
irintensity: 0.0541 0.0601 0.3232 0.0043 0.5175 9.0401 0.8662 0.7488 0.4518 0.0001 0.9811 4.6298 0.8229 2.0052 0.0159 0.8461 0.1342 205.4830 2.0933 0.5340 0.8086 0.6251 14.9822 1.8159 37.5516 0.3115 8.4336 8.4508 1.8184 0.8673 56.7670 2.6457 0.0906 98.8909 38.5171 2.0183 1.9896 39.1952 0.8839 4.3051 12.3191 2.1759 5.2945 2.4838 1.3926 0.0015 0.7320 2.5697 0.5832 0.0676 2.3511 15.2606 6.4077 7.8868 19.7327 0.5403 5.3505 12.4126 0.0226 1.6804 3.7216 0.7212 1.3909 1.2276 0.5231 16.9375 0.6195 1.6719 0.1009 24.9762 56.7944 7.2147 0.4557 29.8747 31.2703 84.6604 8.2110 44.9933 72.4130 45.0723 1.4964 2.7641 25.6888 1.1337 279.7461 13.9430 18.5706 3.0039 0.3912 11.9972 7.1334 18.3460 38.7514 26.4082 29.6931 14.3746 30.5179 57.4402 25.5042
temp: 298.150 k
press: 1.00000 atm
elementType: 7 7 6 6 6 6 6 6 6 6 6 6 6 6 6 6 6 6 6 6 6 1 1 1 1 1 1 1 1 1 1 1 1 1 1
symmnumber: 1
zpe: 720375.3 jmol-1
zpe.correction: 0.274376 hartree
zpe.thermalcorrener: 0.289594 hartree
zpe.thermalcorrenthalpy: 0.290538 hartree
zpe.thermalcorrgfe: 0.231810 hartree
zpe.sumelectzpe: -840.542308 hartree
zpe.sumelectthermal: -840.527091 hartree
zpe.sumelectthermalent: -840.526147 hartree
zpe.sumelectthermalfe: -840.584875 hartree
dipole: -1.0425 -4.4035 0.0006
dipole: 4.5253
quadrupole: -104.4986 -110.9332 -122.6896
quadrupole: -6.8609 0.0004 0.0021
quadrupole: 8.2085 1.7739 -9.9825 -6.8609 0.0004 0.0021
hfenergy: -840.8166848 hartree
pointgroup: C01 [X(C19H14N2)]
dipole: 0.4173685 -1.730763 0.0001013 debye
polarizability: 405.2738277|4.8995157|196.6630033|-0.0126136|-0.0218778|125.1688133 unknown
InChI: InChI=1S/C19H14N2/c20-19-15-8-4-5-9-17(15)21-18-11-10-14(12-16(18)19)13-6-2-1-3-7-13/h1-12H,20H2
charge 0 multiplicity 1
35 atoms
N  -2.224344 1.65627 -0.00015
N  -1.29264 -2.530504 0.000235
C  -0.544684 -0.195054 -0.000025
C  -1.592882 -1.180523 0.000108
C  -0.927213 1.210104 -0.000123
C  -2.960339 -0.731996 0.000095
C  1.848126 0.448006 -0.000182
C  0.851153 -0.531459 -0.000071
C  -3.21211 0.703887 -0.000063
C  0.118067 2.199513 -0.000231
C  1.460142 1.836113 -0.000255
C  3.302512 0.072421 -0.000249
C  -4.084139 -1.627421 0.000223
C  -4.576728 1.16372 -0.000112
C  -5.392475 -1.146635 0.000169
C  -5.640696 0.267014 -0.000007
C  4.004059 -0.103815 -1.222059
C  4.004018 -0.104559 1.221474
C  5.373934 -0.453272 -1.222546
C  5.373896 -0.454009 1.221789
C  6.063284 -0.629908 -0.00042
H  1.177252 -1.579441 -0.000045
H  -0.19711 3.247547 -0.000289
H  2.242612 2.603055 -0.00033
H  -3.934573 -2.714754 0.000382
H  -4.729486 2.247399 -0.000239
H  -0.331241 -2.856049 0.00028
H  -2.026962 -3.230914 0.000249
H  -6.234889 -1.84673 0.000269
H  -6.672695 0.635027 -0.000057
H  3.471503 0.034423 -2.170011
H  3.471439 0.033115 2.169495
H  5.901019 -0.586524 -2.17418
H  5.900954 -0.587826 2.173359
H  7.125239 -0.900323 -0.000484
