program: Gaussian 09
title: 000234207
version: EM64L-G09RevD.01
frameworkgroup: C1[X(C13H14N2O3)]
method: RPBEPBE
basis: SDD
operation: Freq
keyword: #p
keyword: freq=noraman
keyword: PBEPBE/SDD
title: #p freq=noraman PBEPBE/SDD
converged: YES YES NO NO
title: Mulliken charges:
elementType: O O O N N C C C C C C C C C C C C C H H H H H H H H H H H H H H
charge: -0.262567 -0.237319 -0.240415 -0.419161 0.030994 0.403428 0.000986 0.051455 -0.594690 -0.616106 0.502487 0.057158 -0.337588 -0.361694 -0.806488 0.290049 -0.265763 -0.657579 0.265721 0.271136 0.239488 0.333591 0.262290 0.238734 0.238056 0.226479 0.236026 0.233219 0.221069 0.210862 0.228955 0.257187
chargesum: 0.00000
title: Mulliken charges with hydrogens summed into heavy atoms:
elementType: O O O N N C C C C C C C C C C C C C
charge: -0.262567 -0.237319 -0.240415 -0.085570 0.030994 0.403428 0.000986 0.051455 -0.355202 -0.079249 0.502487 0.057158 -0.075298 -0.122960 -0.105926 0.290049 0.188525 0.039424
polarizability: 2.82100241e+02 1.47426113e+01 1.48225225e+02 -2.61243612e+01 1.42158137e+00 9.88344690e+01
1716.lowfreq: -8.5921 -6.4664 0.0007 0.0008 0.0010 3.6809 9.6421 29.1447 45.5387
frequency: 9.4706 29.1237 45.4931 48.3155 75.0111 90.7195 108.1878 113.3687 191.7322 211.8938 217.8365 247.3386 261.7048 276.5500 313.2617 359.3617 373.4075 408.4893 428.7239 445.8209 472.9784 480.6201 516.2800 576.4110 593.7369 599.2513 643.0569 667.4945 712.8556 725.9665 753.2364 779.3213 786.5098 809.9587 818.5447 832.7817 837.0223 875.7261 898.1542 945.2158 954.1129 972.4788 1004.6809 1013.2549 1045.8966 1096.4482 1120.4148 1130.2967 1140.2307 1157.4622 1181.8846 1191.7681 1232.9587 1267.9980 1277.1425 1286.1728 1302.7341 1318.5117 1355.6312 1361.2827 1392.9957 1395.9019 1401.4686 1417.8398 1450.9662 1457.6009 1461.9927 1467.0463 1479.7864 1483.9632 1501.6393 1542.4698 1574.1913 1619.4149 1631.6130 1643.9483 2980.1880 2993.2695 3023.4735 3028.3311 3058.9937 3088.9619 3089.6520 3089.7532 3093.6842 3119.4921 3121.3112 3137.6783 3169.9210 3504.2980
redmass: 4.6059 4.2104 2.0647 1.3150 4.9824 4.1624 4.5059 7.0706 1.7184 3.1191 3.0423 2.7113 4.5513 2.8695 3.2014 4.2652 4.6948 3.7407 4.4960 5.8395 3.5980 3.7927 3.9970 4.7609 3.6130 8.6094 4.1840 3.8278 5.4722 2.3128 2.1720 2.7438 5.5709 1.4313 3.9864 1.4463 3.8093 1.5382 3.5141 2.5418 2.8093 1.3417 1.5936 2.8646 1.5688 2.1995 2.6412 1.4823 4.1812 1.6924 1.8461 1.5740 2.3779 1.6337 1.1226 2.9478 2.4976 2.4439 1.3117 2.0944 1.2306 1.6480 2.5621 1.1304 2.6497 1.0910 1.0449 1.0457 1.3279 1.0524 3.0346 10.4103 6.6804 5.2727 7.0463 8.8709 1.0373 1.0363 1.0590 1.0594 1.0974 1.0974 1.0991 1.1010 1.1036 1.1056 1.0918 1.0892 1.0963 1.0769
irintensity: 2.0378 1.1090 0.5352 1.1663 1.3012 0.7254 1.2965 0.4932 2.8361 1.6641 1.4015 0.8246 6.7922 8.1097 17.6253 4.3903 3.2499 5.6103 6.5510 2.7222 13.6574 18.8208 9.8184 1.9284 4.1993 8.2272 8.0138 6.2020 1.2272 15.6489 38.9738 36.7406 0.3469 5.1358 0.2763 56.5163 15.7005 15.9456 12.5058 0.7144 2.8925 1.6157 4.5543 80.2941 15.1267 75.2471 367.2543 11.8054 67.3166 20.4098 0.7553 22.2368 5.4140 1.8213 3.3389 5.1074 36.7043 105.3576 6.5723 6.2110 23.1041 5.2728 14.1502 39.2091 0.2110 12.7320 12.6116 14.1354 24.9647 16.9429 7.0985 13.3630 14.3049 592.1502 12.2991 107.8459 28.1849 20.7534 5.6398 36.4228 16.1430 37.2903 17.2139 3.4781 0.8696 35.4990 14.4614 10.4088 7.9480 29.3918
temp: 298.150 k
press: 1.00000 atm
elementType: 8 8 8 7 7 6 6 6 6 6 6 6 6 6 6 6 6 6 1 1 1 1 1 1 1 1 1 1 1 1 1 1
symmnumber: 1
zpe: 654441.9 jmol-1
zpe.correction: 0.249264 hartree
zpe.thermalcorrener: 0.266430 hartree
zpe.thermalcorrenthalpy: 0.267374 hartree
zpe.thermalcorrgfe: 0.201292 hartree
zpe.sumelectzpe: -837.684148 hartree
zpe.sumelectthermal: -837.666981 hartree
zpe.sumelectthermalent: -837.666037 hartree
zpe.sumelectthermalfe: -837.732120 hartree
dipole: -3.5987 0.4563 0.0457
dipole: 3.6278
quadrupole: -73.3834 -101.4348 -109.9597
quadrupole: -6.7840 -0.2940 2.1908
quadrupole: 21.5426 -6.5089 -15.0338 -6.7840 -0.2940 2.1908
hfenergy: -837.9334118 hartree
pointgroup: C01 [X(C13H14N2O3)]
dipole: 1.4101724 -0.1683308 0.1424068 debye
polarizability: 282.4698035|24.1370767|131.1442594|16.7980351|-22.9653089|115.5458717 unknown
InChI: InChI=1S/C13H14N2O3/c1-3-18-12(16)7-11-13(17)15-10-6-8(2)4-5-9(10)14-11/h4-6,15H,3,7H2,1-2H3
charge 0 multiplicity 1
32 atoms
O  -4.301952 0.655986 -0.813097
O  -1.476594 -1.889894 0.197858
O  -2.704467 1.207368 0.799621
N  0.773173 -1.305653 0.463333
N  0.37608 0.933245 -1.187163
C  1.869991 -0.478056 0.201618
C  1.644106 0.651233 -0.651598
C  -0.637731 0.127195 -0.902135
C  3.156695 -0.729946 0.74042
C  -2.009075 0.426252 -1.451864
C  4.233785 0.128525 0.440088
C  -0.520977 -1.093462 -0.049893
C  2.737189 1.507846 -0.948127
C  4.007521 1.252522 -0.414146
C  5.616181 -0.125428 1.011237
C  -2.996578 0.798245 -0.345514
C  -5.394756 0.95423 0.166866
C  -5.713286 -0.289184 1.001405
H  -2.422647 -0.442902 -1.992402
H  -1.932776 1.272227 -2.157043
H  3.313847 -1.597295 1.393766
H  0.884254 -2.128649 1.065006
H  2.546804 2.366325 -1.59916
H  4.843397 1.921137 -0.648554
H  5.946476 0.721929 1.641024
H  5.644387 -1.037545 1.63086
H  6.364589 -0.239279 0.204887
H  -5.074741 1.797204 0.804508
H  -6.239886 1.256875 -0.471922
H  -6.565187 -0.078511 1.674668
H  -5.984194 -1.139631 0.352665
H  -4.84603 -0.577809 1.618189
