program: Gaussian 09
title: 000234205
version: EM64L-G09RevD.01
frameworkgroup: C1[X(C11H13NO3)]
method: RPBEPBE
basis: SDD
operation: Freq
keyword: #p
keyword: freq=noraman
keyword: PBEPBE/SDD
title: #p freq=noraman PBEPBE/SDD
converged: YES YES NO YES
title: Mulliken charges:
elementType: O O O N C C C C C C C C C C C H H H H H H H H H H H H H
charge: -0.311079 -0.229817 -0.262382 -0.459805 0.488849 0.317838 -0.463135 -0.360737 -0.323410 -0.352711 0.115826 0.265347 -0.215762 -0.790975 -0.672030 0.225600 0.303360 0.242468 0.278478 0.332944 0.231683 0.231685 0.235488 0.235501 0.261002 0.215666 0.230053 0.230053
chargesum: 0.00000
title: Mulliken charges with hydrogens summed into heavy atoms:
elementType: O O O N C C C C C C C C C C C
charge: -0.311079 -0.229817 -0.262382 -0.126861 0.488849 0.317838 -0.237535 -0.057377 -0.080942 -0.074233 0.115826 0.265347 0.247606 -0.058983 0.003743
polarizability: 2.51191489e+02 -2.26504895e+00 1.32196474e+02 -1.97633601e-03 3.99292547e-06 6.93647215e+01
1716.lowfreq: -3.0776 -2.4402 -0.0009 -0.0001 0.0006 7.6671 34.9690 48.7442 63.3171
frequency: 34.4787 48.5955 63.2479 76.1908 81.5925 100.5278 153.2146 156.1984 161.9184 210.7977 247.8236 271.2482 295.8340 340.7895 360.0184 411.5445 412.8850 476.5720 498.8907 570.4188 592.0640 626.4278 653.1568 692.1452 706.8200 718.1627 742.3541 801.2853 810.5589 826.3445 871.2458 880.1385 944.1342 954.8030 980.4070 1003.0866 1010.1167 1028.1020 1040.5206 1073.5932 1111.8439 1129.3806 1139.7988 1160.2842 1192.4948 1250.8860 1267.6163 1282.0143 1309.1045 1355.8970 1366.0024 1377.2907 1402.6215 1426.7678 1448.4760 1463.8726 1463.8815 1476.0301 1487.7754 1495.9399 1520.4030 1569.7882 1599.2107 1624.5761 1664.9284 2984.3587 2997.6228 3012.0486 3069.3043 3070.8491 3094.3842 3109.3850 3118.5888 3125.5154 3153.6183 3158.3956 3191.4813 3537.0189
redmass: 4.1701 2.7935 3.8870 4.4726 4.6808 3.3767 1.0278 4.2759 5.1386 4.3742 1.2251 5.9766 5.0234 6.5897 3.6180 2.9593 3.7425 5.0820 3.0317 4.6587 2.3186 7.0478 1.4124 5.5755 4.1186 5.9257 3.4549 1.0959 4.6787 1.4312 4.2870 1.3804 2.1881 1.3689 4.4873 3.0266 1.3861 1.7278 3.4210 2.3952 2.2313 1.3234 1.4626 3.3235 1.1368 1.1299 1.9769 4.3293 1.3536 1.5465 1.3087 2.9578 1.2707 4.3499 1.1024 1.0424 1.0475 1.0625 1.1636 1.7498 3.1622 5.2598 5.9715 6.4449 8.1426 1.0374 1.0359 1.0582 1.0970 1.1069 1.0985 1.1028 1.0893 1.0990 1.0905 1.0943 1.0949 1.0760
irintensity: 0.0361 0.8131 0.0579 0.4091 4.1805 4.5749 0.3386 3.3831 1.0011 8.0803 0.9815 15.2916 1.1330 3.9940 3.4080 0.0525 8.2960 3.5771 16.5186 17.4158 19.3027 2.7761 31.2865 1.0863 52.7432 12.1595 0.7907 3.8657 4.3451 56.2995 1.3166 51.6847 63.0899 0.3421 85.8891 0.3432 0.0539 1.6710 268.2115 15.7754 23.6203 21.7160 5.1392 639.1213 65.7020 0.0061 46.8157 234.5073 14.9397 85.1650 22.5582 243.6959 23.8046 64.9018 24.6564 0.7207 32.2282 24.6983 51.4525 93.1986 306.0494 324.9547 83.3969 178.2102 200.0464 4.1785 22.3105 22.8654 14.0090 7.7419 29.8527 45.3210 19.4938 15.5032 4.5026 9.3544 1.8074 36.5935
temp: 298.150 k
press: 1.00000 atm
elementType: 8 8 8 7 6 6 6 6 6 6 6 6 6 6 6 1 1 1 1 1 1 1 1 1 1 1 1 1
symmnumber: 1
zpe: 581012.5 jmol-1
zpe.correction: 0.221296 hartree
zpe.thermalcorrener: 0.236448 hartree
zpe.thermalcorrenthalpy: 0.237392 hartree
zpe.thermalcorrgfe: 0.177638 hartree
zpe.sumelectzpe: -706.308426 hartree
zpe.sumelectthermal: -706.293274 hartree
zpe.sumelectthermalent: -706.292330 hartree
zpe.sumelectthermalfe: -706.352084 hartree
dipole: 3.9580 -5.0365 0.0001
dipole: 6.4056
quadrupole: -81.3995 -88.1468 -89.9072
quadrupole: 12.1839 0.0000 0.0004
quadrupole: 5.0850 -1.6623 -3.4227 12.1839 0.0000 0.0004
hfenergy: -706.529722 hartree
pointgroup: C01 [X(C11H13N1O3)]
dipole: 1.5638036 1.9763027 -0.0004338 debye
polarizability: 251.2053186|1.8667137|132.1826419|0.0001668|-0.0124826|69.3647239 unknown
InChI: InChI=1S/C11H13NO3/c1-3-15-11(14)12-10-6-4-9(5-7-10)8(2)13/h4-7,12H,3H2,1-2H3
charge 0 multiplicity 1
28 atoms
O  3.766037 0.413608 -0.000247
O  -4.640256 -1.417707 0.000132
O  2.474237 -1.557313 0.000127
N  1.519745 0.619884 -0.000212
C  0.128134 0.365752 -0.000229
C  -2.698726 0.007661 -0.000276
C  -0.741832 1.491803 -0.000485
C  -0.42153 -0.947649 0.000005
C  -2.134712 1.312491 -0.000502
C  -1.816277 -1.107715 -0.000019
C  -4.177315 -0.237403 -0.000296
C  2.558405 -0.30554 0.000022
C  5.003458 -0.422086 -0.000249
C  -5.121874 0.963245 -0.000329
C  6.18432 0.542774 -0.000508
H  -0.320948 2.505095 -0.000666
H  0.246528 -1.811045 0.000203
H  -2.781887 2.195525 -0.000699
H  -2.259767 -2.109111 0.000157
H  1.821984 1.597041 -0.00039
H  4.985892 -1.069388 0.895043
H  4.985715 -1.069654 -0.895345
H  -4.959698 1.596323 -0.892629
H  -4.959465 1.596573 0.891751
H  -6.160759 0.600745 -0.000141
H  7.130214 -0.028753 -0.0005
H  6.168659 1.186879 -0.896178
H  6.168816 1.187163 0.89496
