program: Gaussian 09
title: 000234203
version: EM64L-G09RevD.01
frameworkgroup: C1[X(C10H11NO6)]
method: RPBEPBE
basis: SDD
operation: Freq
keyword: #p
keyword: freq=noraman
keyword: PBEPBE/SDD
title: #p freq=noraman PBEPBE/SDD
converged: YES YES NO NO
title: Mulliken charges:
elementType: O O O O O O N C C C C C C C C C C H H H H H H H H H H H
charge: -0.234319 -0.271467 -0.237625 -0.154798 -0.183477 -0.149755 0.012438 0.336975 0.010562 0.280070 0.041479 -0.781868 0.136857 0.121295 -0.740061 -0.259611 -0.664583 0.248984 0.256043 0.281932 0.246447 0.258478 0.268910 0.241778 0.230450 0.229304 0.224035 0.251527
chargesum: 0.00000
title: Mulliken charges with hydrogens summed into heavy atoms:
elementType: O O O O O O N C C C C C C C C C C
charge: -0.234319 -0.271467 -0.237625 -0.154798 -0.183477 -0.149755 0.012438 0.336975 0.010562 0.280070 0.041479 0.005091 0.136857 0.121295 0.033774 0.212617 0.040284
polarizability: 2.06359604e+02 3.03685237e+00 1.45840925e+02 -3.94404990e+00 -1.25625528e+00 8.88851381e+01
1716.lowfreq: -8.2303 0.0004 0.0005 0.0008 2.1812 4.5311 31.0418 46.7339 56.1256
frequency: 31.0190 46.7283 56.1171 62.0120 73.5231 96.1625 106.5133 120.2134 151.2708 157.9360 183.6966 211.6379 227.4801 235.3117 283.3667 303.0088 325.5562 331.0433 375.2881 401.1566 433.3598 467.9439 510.4297 534.0500 572.2481 586.2373 616.7601 632.2567 690.3359 724.9792 733.3125 743.6266 773.2081 817.0432 823.3632 854.2557 958.3726 998.0938 1024.7573 1037.6658 1039.1865 1041.4058 1077.6241 1094.4157 1137.3386 1155.3268 1197.4309 1224.2354 1278.6551 1285.2613 1349.5542 1368.0143 1385.2043 1392.3041 1401.6968 1403.9314 1445.4144 1448.3253 1450.4973 1457.9968 1466.5814 1470.6199 1483.8899 1515.9115 1580.7270 1619.0213 1718.9221 2994.0877 3008.1316 3008.6889 3036.0456 3084.9942 3088.2106 3096.3276 3097.1049 3123.7460 3133.2162 3151.0037
redmass: 4.5145 5.2734 3.7431 7.3026 4.4674 2.8718 1.2185 1.1789 3.7776 4.4015 4.3394 4.8484 3.1784 1.7980 7.5503 3.5353 3.8309 4.2375 3.5179 6.2725 4.0633 6.2804 6.0110 5.4531 6.7278 5.9139 6.6717 7.1915 6.5748 10.4740 4.4900 5.7015 3.9724 1.5532 4.3701 5.8288 3.6808 2.2767 2.1233 1.6061 1.7109 2.9443 2.5900 2.1843 6.6679 1.6810 6.8661 12.4143 1.1156 6.2017 1.6238 3.6701 6.7808 1.2398 1.1986 1.1892 1.1445 1.0825 1.0998 1.0987 1.0449 1.1826 1.0526 4.6609 5.7805 9.7619 12.8411 1.0361 1.0385 1.0413 1.0599 1.0931 1.0974 1.1023 1.0945 1.1069 1.1015 1.0989
irintensity: 0.1131 1.9304 0.2564 1.3020 1.9155 0.7250 0.4340 1.4590 2.2148 0.1787 2.8579 4.2487 1.3001 2.6872 1.4862 2.6546 3.3256 13.9462 4.2453 2.7520 5.4653 4.9890 1.9001 3.5152 9.2720 2.6924 5.3423 18.5788 13.7245 6.5499 30.0256 16.6472 26.8571 3.0287 27.8819 36.4958 62.0298 9.3145 59.0458 15.1749 18.2954 122.2243 99.7973 14.6294 2.1775 31.3510 175.3678 139.9672 3.8708 59.7617 37.8652 138.2564 121.4342 18.9147 25.4744 59.7596 68.0114 5.7688 25.1838 22.2038 17.8143 48.5512 17.8134 124.2076 20.3046 248.6472 521.4597 15.0044 0.7878 1.0497 25.8410 3.6012 35.2097 3.3995 5.1263 24.2452 5.1328 7.3630
temp: 298.150 k
press: 1.00000 atm
elementType: 8 8 8 8 8 8 7 6 6 6 6 6 6 6 6 6 6 1 1 1 1 1 1 1 1 1 1 1
symmnumber: 1
zpe: 530079.6 jmol-1
zpe.correction: 0.201897 hartree
zpe.thermalcorrener: 0.219479 hartree
zpe.thermalcorrenthalpy: 0.220423 hartree
zpe.thermalcorrgfe: 0.155109 hartree
zpe.sumelectzpe: -892.393012 hartree
zpe.sumelectthermal: -892.375430 hartree
zpe.sumelectthermalent: -892.374486 hartree
zpe.sumelectthermalfe: -892.439799 hartree
dipole: -9.1700 0.0081 0.5982
dipole: 9.1895
quadrupole: -107.9076 -101.6624 -100.0951
quadrupole: -6.9552 -2.7878 -1.7133
quadrupole: -4.6859 1.5593 3.1266 -6.9552 -2.7878 -1.7133
hfenergy: -892.5949085 hartree
pointgroup: C01 [X(C10H11N1O6)]
dipole: -3.5475987 0.0021744 0.6969906 debye
polarizability: 204.2806991|5.4500593|133.4349755|-15.4348464|22.9173997|103.3699928 unknown
InChI: InChI=1S/C10H11NO6/c1-4-16-9(12)7-5(2)8(11(14)15)10(13)17-6(7)3/h4H2,1-3H3
charge 0 multiplicity 1
28 atoms
O  0.934169 1.697038 0.905772
O  -2.738612 -0.339803 1.005967
O  -2.341152 -1.134764 -1.147339
O  3.236695 1.560948 0.691151
O  3.324376 -2.105216 -0.346647
O  3.780684 -0.280854 -1.645882
N  3.067944 -0.918933 -0.787613
C  0.592633 -0.76735 -0.439892
C  -0.545928 -0.026398 0.095367
C  -0.338561 1.192729 0.746066
C  1.864988 -0.227191 -0.261713
C  0.377077 -2.07487 -1.16618
C  -1.932334 -0.550138 -0.113975
C  2.157888 1.017906 0.430292
C  -1.356739 2.133005 1.32683
C  -4.162254 -0.806328 0.899048
C  -5.041278 0.25546 0.233537
H  -0.164453 -2.786938 -0.516945
H  1.319055 -2.546861 -1.4724
H  -0.270233 -1.91309 -2.043922
H  -2.283594 2.150241 0.734518
H  -0.921502 3.143354 1.382447
H  -1.631593 1.811538 2.347352
H  -4.173996 -1.752117 0.330306
H  -4.445598 -0.986787 1.947717
H  -6.092969 -0.08565 0.235109
H  -4.994294 1.213692 0.779653
H  -4.73902 0.418877 -0.814425
