program: Gaussian 09
title: 000234197
version: EM64L-G09RevD.01
frameworkgroup: C1[X(C12H6N2S4)]
method: RPBEPBE
basis: SDD
operation: Freq
keyword: #p
keyword: freq=noraman
keyword: PBEPBE/SDD
title: #p freq=noraman PBEPBE/SDD
converged: NO NO NO NO
title: Mulliken charges:
elementType: S S S S N N C C C C C C C C C C C C H H H H H H
charge: 0.298606 0.298607 0.312569 0.312569 0.026800 0.026800 -0.224748 -0.224748 -0.163209 -0.163211 -0.084722 -0.084722 -0.288077 -0.288077 -0.136975 -0.136975 -0.516782 -0.516782 0.255741 0.255741 0.250775 0.250775 0.270022 0.270022
chargesum: 0.00000
title: Mulliken charges with hydrogens summed into heavy atoms:
elementType: S S S S N N C C C C C C C C C C C C
charge: 0.298606 0.298607 0.312569 0.312569 0.026800 0.026800 -0.224748 -0.224748 -0.163209 -0.163211 -0.084722 -0.084722 -0.032336 -0.032336 0.113800 0.113800 -0.246760 -0.246760
polarizability: 5.77809938e+02 -1.18181232e+01 2.01538309e+02 3.91816240e-03 2.04052677e-03 7.20872569e+01
1716.lowfreq: 0.0015 0.0024 0.0024 2.2101 6.3236 12.4272 34.2251 39.3924 49.8130
frequency: 34.2251 39.3924 49.7583 59.9271 97.7302 105.2984 170.5057 196.3192 204.0795 244.6648 246.4157 304.8023 326.7947 338.3038 436.6528 449.2139 456.3903 475.6412 546.1813 556.8066 563.3516 575.3192 589.6620 613.9213 645.1726 650.2695 668.4013 684.1393 684.4472 704.9694 705.3400 727.7048 754.3078 803.1186 823.1426 829.8611 830.1467 846.0922 914.4975 914.5513 921.7998 1059.8659 1061.0961 1086.9496 1086.9701 1162.3465 1182.1751 1221.2284 1223.0501 1273.1360 1318.8617 1330.8489 1361.7088 1373.7260 1437.7570 1444.8986 1466.7337 1471.6261 1559.9029 1572.1542 3166.0991 3166.1340 3187.8803 3187.9212 3234.4186 3234.4215
redmass: 9.4177 5.8893 9.1876 7.4420 6.8764 10.0813 7.5475 11.5651 8.5319 12.6563 7.0975 11.8411 12.8506 8.5823 28.3545 6.1822 13.1293 5.8053 4.2618 14.0426 3.3837 15.4820 4.9347 8.6587 11.1630 10.2695 11.7687 7.1562 7.0256 1.1727 1.1681 10.0571 9.1893 6.5274 5.2515 1.3305 1.3293 7.1432 1.3722 1.3716 10.6618 1.6556 1.6604 1.1368 1.1575 6.7807 6.7133 1.5021 1.5793 6.4046 2.7530 2.6155 5.4139 9.7788 7.3613 8.0196 5.6222 5.3101 7.7978 8.4958 1.0912 1.0912 1.0962 1.0962 1.1002 1.1001
irintensity: 0.8465 1.2134 0.0000 0.6200 0.0000 0.0000 3.4800 0.5833 0.0000 3.9158 0.0000 3.8925 0.0000 1.6346 0.0000 0.0000 1.0954 5.9040 0.0000 0.0000 2.0608 12.0909 0.0000 3.2152 0.0000 22.0080 0.0000 12.3238 0.0000 0.0000 217.7755 0.0000 101.5536 0.0000 23.4113 0.0000 33.5849 0.0000 0.0000 0.3156 52.6272 0.0000 35.6941 0.0000 10.5685 31.2834 0.0000 31.5284 0.0000 0.0000 10.1092 0.0000 24.0485 0.0000 0.0000 82.5332 0.0000 172.6745 0.0000 76.3994 17.2541 0.0001 15.4807 0.0000 1.0471 0.0005
temp: 298.150 k
press: 1.00000 atm
elementType: 16 16 16 16 7 7 6 6 6 6 6 6 6 6 6 6 6 6 1 1 1 1 1 1
symmnumber: 1
zpe: 386760.0 jmol-1
zpe.correction: 0.147309 hartree
zpe.thermalcorrener: 0.162783 hartree
zpe.thermalcorrenthalpy: 0.163727 hartree
zpe.thermalcorrgfe: 0.102176 hartree
zpe.sumelectzpe: -2161.358207 hartree
zpe.sumelectthermal: -2161.342734 hartree
zpe.sumelectthermalent: -2161.341790 hartree
zpe.sumelectthermalfe: -2161.403340 hartree
dipole: 0.0000 0.0000 0.0003
dipole: 0.0003
quadrupole: -87.8628 -129.0570 -138.8245
quadrupole: -10.0153 0.0002 0.0006
quadrupole: 30.7186 -10.4756 -20.2430 -10.0153 0.0002 0.0006
hfenergy: -2161.5055166 hartree
pointgroup: C01 [X(C12H6N2S4)]
dipole: 0.0000014 -0.0000014 -0.000101 debye
dipolederiv: -0.0648194 0.0536367 -0.0000048 0.2646084 -0.3397188 0.0000064 -0.0000103 0.0000283 0.1297168 -0.0648166 0.0536384 0.000003 0.2646088 -0.3397173 -0.0000261 0.0000254 -0.0000411 0.1297177 0.2500461 -0.1233924 0.0000377 -0.0498793 -0.1789369 0.0000978 -0.0000478 0.0000859 0.1681129 0.250046 -0.1233929 -0.0000239 -0.0498798 -0.1789367 -0.0000683 0.000024 -0.0000599 0.168113 -0.5601245 -0.223412 0.0000064 -0.485875 -0.6153383 -0.0000146 -0.0000014 -0.0000049 -0.1303083 -0.5601224 -0.2234119 -0.0000292 -0.485876 -0.6153391 -0.000018 -0.0000368 -0.0000154 -0.1303084 0.2904799 0.2662303 0.0000031 0.2049121 0.1043041 -0.0000183 -0.0000422 -0.0000212 -0.0338638 0.290477 0.2662309 0.0000196 0.2049125 0.1043039 0.0000258 0.0000661 0.0000299 -0.0338641 0.8051718 -0.1368672 0.0000575 0.0673834 0.7827724 0.0000504 -0.0000462 0.0000155 -0.0193502 0.8051697 -0.1368674 -0.0000509 0.0673844 0.7827715 0.0000129 0.0000305 0.0000202 -0.0193506 -0.3836364 -0.0812761 0.0000062 -0.3802876 0.250572 -0.0001558 0.0002012 -0.0001296 -0.1397633 -0.3836343 -0.0812757 -0.0000036 -0.3802876 0.2505727 0.0000992 -0.0001366 0.0000892 -0.1397633 0.3475062 -0.138676 0.0000668 0.0482517 -0.1417696 -0.0000168 0.0000445 -0.0000163 -0.1421813 0.3475046 -0.1386763 -0.0000422 0.048252 -0.1417701 0.0000099 -0.0000239 0.0000105 -0.1421814 -0.2447942 0.1271384 -0.0000347 0.57662 -0.1806142 0.000026 -0.000246 0.0000168 -0.1375439 -0.2447939 0.1271385 0.0000219 0.5766193 -0.180614 -0.0000133 0.0001598 -0.0000123 -0.1375438 -0.5633164 0.2216849 -0.0000659 -0.2244176 0.214797 -0.0001483 0.0000574 -0.0001298 -0.3047461 -0.5633156 0.221685 0.0000397 -0.224417 0.2147968 0.0001012 -0.0000392 0.0000915 -0.3047463 0.1304797 0.0642808 -0.0000203 0.0879027 -0.0079823 0.0000713 -0.0000163 0.0000598 0.1951272 0.1304801 0.0642807 0.0000149 0.087903 -0.007982 -0.0000479 0.0000123 -0.0000427 0.1951274 -0.0282019 -0.0680842 0.0000148 -0.120671 0.032929 0.0000468 0.0000231 0.0000461 0.1956283 -0.028202 -0.0680838 -0.0000106 -0.120671 0.0329291 -0.0000325 -0.0000165 -0.0000314 0.1956284 0.0212077 0.038735 -0.0000182 0.011452 0.0789851 0.0000411 0.000041 0.0000379 0.2191715 0.0212087 0.038736 0.0000126 0.0114519 0.0789858 -0.0000289 -0.0000223 -0.000027 0.2191717 unknown
polarizability: 578.1679374|-2.1988127|201.1803097|0.0038396|-0.0021848|72.0872569 unknown
InChI: InChI=1S/C12H6N2S4/c1-3-7(15-5-1)9-13-11-12(17-9)14-10(18-11)8-4-2-6-16-8/h1-6H
charge 0 multiplicity 1
24 atoms
S  1.32489 1.687174 0.000098
S  -1.324874 -1.687273 0.000005
S  4.590203 -1.518458 0.000656
S  -4.590187 1.518358 0.000461
N  -1.492819 1.028209 0.000103
N  1.492836 -1.028309 0.000082
C  -0.168103 0.685857 0.000109
C  0.168119 -0.685957 0.000085
C  2.265734 0.067612 0.000131
C  -2.265717 -0.067712 0.000098
C  3.703048 0.064648 0.00018
C  -3.703032 -0.064748 0.00013
C  4.597724 1.14002 -0.000104
C  -4.597707 -1.14012 -0.000068
C  5.976168 0.742483 0.000053
C  -5.976151 -0.742583 0.000038
C  6.149034 -0.636773 0.000468
C  -6.149018 0.636673 0.00033
H  4.272087 2.184261 -0.000452
H  -4.27207 -2.184361 -0.000307
H  6.8094 1.448821 -0.000137
H  -6.809383 -1.448921 -0.000094
H  7.077354 -1.206174 0.000665
H  -7.077338 1.206074 0.000468
