program: Gaussian 09
title: 000234190
version: EM64L-G09RevD.01
frameworkgroup: C1[X(C15H23O2P)]
method: RPBEPBE
basis: SDD
operation: Freq
keyword: #p
keyword: freq=noraman
keyword: PBEPBE/SDD
title: #p freq=noraman PBEPBE/SDD
converged: YES YES NO NO
title: Mulliken charges:
elementType: P O O C C C C C C C C C C C C C C C H H H H H H H H H H H H H H H H H H H H H H H
charge: 1.134300 -0.542287 -0.626950 -0.070451 -0.757390 -0.403463 -0.740799 -0.704434 0.343258 -0.214558 0.548773 -0.356042 -0.410434 -0.367162 -0.447951 -0.381578 -0.716390 -0.693320 0.237216 0.281728 0.287585 0.232138 0.230674 0.282351 0.282019 0.245010 0.212378 0.222384 0.201738 0.298943 0.242339 0.196951 0.195179 0.233385 0.229646 0.229047 0.210326 0.208340 0.211508 0.205608 0.230385
chargesum: 0.00000
title: Mulliken charges with hydrogens summed into heavy atoms:
elementType: P O O C C C C C C C C C C C C C C C
charge: 1.134300 -0.542287 -0.626950 0.166764 -0.188077 0.059349 -0.176429 -0.024661 0.343258 -0.012820 0.548773 -0.057099 -0.168095 0.024968 -0.214566 -0.151932 -0.068676 -0.045820
polarizability: 2.55028060e+02 1.18115489e-01 1.70109089e+02 1.21359806e+00 1.14544141e+01 1.49648586e+02
1716.lowfreq: -23.9663 -18.4251 -10.2700 -0.0019 -0.0015 -0.0013 1.9241 13.9052 42.1527
frequency: -19.9739 9.8852 42.1030 42.6275 61.9487 88.3712 105.9229 131.8077 161.2183 178.3935 182.3467 219.1493 220.3929 232.0764 235.3415 248.5595 264.3054 296.9241 330.0734 347.0482 350.0019 373.0753 413.9190 426.7599 448.0482 485.5515 531.6047 555.4284 583.2100 587.9571 632.2304 637.5407 707.4615 722.9994 736.9828 776.3430 797.1600 801.6851 827.3278 835.0551 847.1057 856.2911 866.9528 914.5920 925.9122 952.9076 960.6095 973.0955 978.7996 996.1255 1007.5988 1013.8054 1019.6028 1028.2368 1045.4291 1066.1964 1084.9729 1099.8676 1112.9574 1122.3525 1150.4113 1152.5570 1172.5231 1199.7751 1206.5584 1215.5538 1218.8149 1246.1775 1258.2702 1283.2689 1285.2138 1299.5623 1314.5844 1329.7891 1332.5123 1337.1545 1380.4632 1385.8958 1392.0532 1394.1109 1414.6035 1420.9566 1425.6074 1457.5503 1463.4673 1474.3396 1474.9732 1476.8596 1477.3979 1483.6065 1485.2531 1493.6202 1581.7705 1613.4732 2963.3850 2970.9946 2974.0215 2975.4633 2979.8100 2993.9837 3011.9459 3018.6604 3037.3340 3043.0931 3064.0020 3066.0269 3068.6051 3076.1437 3077.6039 3079.3925 3081.6637 3117.1756 3122.0596 3123.3140 3125.2703 3156.7869 3160.0783
redmass: 3.3733 4.2410 3.4674 3.4715 3.1232 4.1131 2.4357 3.1774 2.7300 3.6872 2.4907 1.2790 1.1032 2.6276 1.5234 2.5225 3.2820 4.5505 3.9150 2.3181 2.4848 2.6875 2.9883 3.8798 3.5911 5.3548 4.1235 2.6560 3.7229 3.7365 5.2800 5.0794 2.7616 2.9711 3.5357 2.7226 1.3187 1.8370 5.0435 1.3692 1.7810 1.7313 1.8838 2.0110 1.7083 1.3516 1.2439 1.3611 2.1375 1.7848 2.4796 4.6591 1.4261 2.5486 1.4449 1.6242 1.4678 2.5396 1.4901 1.0636 1.8485 1.6396 1.6403 1.6680 1.5421 2.4716 1.4988 1.3062 1.2477 1.3031 1.4411 1.2865 1.3840 1.5303 1.7612 1.3856 3.1442 1.2189 1.2209 1.2033 2.7620 1.0885 1.0801 1.0843 1.0694 1.0537 1.0481 1.0551 1.0920 1.0626 1.0502 2.2417 6.9431 6.3519 1.0693 1.0707 1.0355 1.0388 1.0357 1.0651 1.0794 1.1009 1.0618 1.0627 1.0999 1.0996 1.0992 1.0996 1.1000 1.0997 1.0998 1.1041 1.0896 1.1054 1.0879 1.0954 1.0960
irintensity: 0.3894 2.2001 0.2561 0.1455 0.4363 3.1624 0.9426 1.0631 0.6471 2.1020 0.0733 0.6561 0.0952 3.8587 0.6947 5.8851 5.9526 19.5859 5.3397 1.6858 3.5580 7.6195 0.2789 2.0983 2.1741 26.0666 8.7425 34.7694 9.3488 46.9747 8.7978 6.8721 26.9267 85.3655 2.6520 3.8602 3.5727 13.8581 146.2378 18.1633 22.7754 30.4364 27.9586 7.4440 8.7310 0.5049 7.7823 0.6036 4.8415 24.5960 7.5378 78.6112 1.1521 4.5607 3.2355 9.0679 57.5947 3.6060 10.1582 10.8924 3.4883 24.6374 113.1359 115.8675 4.8892 31.0411 7.3224 1.3117 8.3338 0.0602 1.7138 6.6115 3.0319 0.0628 6.7199 4.2701 9.8183 7.2978 14.7262 16.0334 2.6499 23.6212 3.2908 6.9554 2.4936 2.6495 5.7513 15.6254 8.0850 6.7939 12.7095 183.9109 6.2753 36.8907 12.7815 32.8432 67.5639 16.1714 25.1615 18.4886 48.4376 31.7195 12.1819 1.9187 14.5598 22.3809 73.6550 32.4987 55.2317 53.5345 38.8723 2.3839 17.5261 5.9212 20.3024 5.0779 5.9022
temp: 298.150 k
press: 1.00000 atm
elementType: 15 8 8 6 6 6 6 6 6 6 6 6 6 6 6 6 6 6 1 1 1 1 1 1 1 1 1 1 1 1 1 1 1 1 1 1 1 1 1 1 1
symmnumber: 1
zpe: 909687.0 jmol-1
zpe.correction: 0.346481 hartree
zpe.thermalcorrener: 0.365525 hartree
zpe.thermalcorrenthalpy: 0.366469 hartree
zpe.thermalcorrgfe: 0.297837 hartree
zpe.sumelectzpe: -1075.681319 hartree
zpe.sumelectthermal: -1075.662275 hartree
zpe.sumelectthermalent: -1075.661331 hartree
zpe.sumelectthermalfe: -1075.729963 hartree
dipole: -1.4874 -4.0374 0.7025
dipole: 4.3596
quadrupole: -95.2543 -125.0642 -118.2331
quadrupole: 9.4928 0.2770 -0.2770
quadrupole: 17.5962 -12.2136 -5.3826 9.4928 0.2770 -0.2770
hfenergy: -1076.0278001 hartree
pointgroup: C01 [X(C15H23O2P1)]
dipole: 0.5627121 1.5469019 -0.4820587 debye
polarizability: 255.0196741|0.9613016|156.4977471|-0.9621963|-14.9945392|163.2683137 unknown
InChI: InChI=1S/C15H23O2P/c1-4-13(3)14-5-7-15(8-6-14)17-18(16)10-9-12(2)11-18/h5-8,12-13H,4,9-11H2,1-3H3
charge 0 multiplicity 1
41 atoms
P  2.644569 -0.670149 0.645521
O  1.433979 -0.584174 -0.663984
O  2.435855 -1.849952 1.710013
C  4.600596 0.885493 -0.474301
C  4.200018 -0.617782 -0.412581
C  4.209269 1.532173 0.899312
C  2.770987 1.10422 1.296188
C  3.928115 1.6075 -1.665553
C  0.039689 -0.517241 -0.403861
C  -4.298902 -0.240757 0.112481
C  -2.781407 -0.332462 -0.068248
C  -0.582471 -1.202775 0.665829
C  -0.729784 0.248761 -1.310365
C  -4.776952 1.219444 0.371214
C  -1.983221 -1.092439 0.822277
C  -2.126776 0.330321 -1.141026
C  -5.051681 -0.855335 -1.097755
C  -4.21139 1.838929 1.66659
H  5.698325 0.956956 -0.594058
H  3.985608 -1.055251 -1.399857
H  4.959382 -1.23114 0.103068
H  4.289507 2.632135 0.839675
H  4.917903 1.189171 1.677632
H  2.607082 1.098507 2.384603
H  1.994151 1.718408 0.812634
H  2.828515 1.502862 -1.632535
H  4.178292 2.684278 -1.662976
H  4.270928 1.181249 -2.625957
H  -4.564193 -0.834978 1.011849
H  0.018007 -1.811554 1.34966
H  -0.224449 0.759122 -2.136684
H  -5.885091 1.219959 0.412918
H  -4.498584 1.851377 -0.496755
H  -2.464916 -1.620186 1.654769
H  -2.711182 0.923567 -1.854727
H  -4.736355 -1.899039 -1.275652
H  -6.144047 -0.846675 -0.923667
H  -4.85392 -0.282076 -2.023101
H  -4.582072 2.870508 1.810982
H  -4.509327 1.245919 2.552261
H  -3.107255 1.872608 1.642168
