program: Gaussian 09
title: 000234185
version: EM64L-G09RevD.01
frameworkgroup: C1[X(C13H22N2O)]
method: RPBEPBE
basis: SDD
operation: Freq
keyword: #p
keyword: freq=noraman
keyword: PBEPBE/SDD
title: #p freq=noraman PBEPBE/SDD
converged: YES YES NO NO
title: Mulliken charges:
elementType: O N N C C C C C C C C C C C C C H H H H H H H H H H H H H H H H H H H H H H
charge: -0.296348 -0.143939 -0.417903 -0.548702 -0.555958 0.596379 0.602342 0.269554 -0.821641 -0.825700 -0.420507 -0.728293 -0.728635 0.513046 -0.792532 -0.720526 0.242501 0.211562 0.261015 0.206699 0.229787 0.210675 0.248778 0.230004 0.211009 0.239785 0.202638 0.240183 0.217739 0.225770 0.214256 0.238138 0.246179 0.225385 0.246169 0.218962 0.225419 0.226710
chargesum: 0.00000
title: Mulliken charges with hydrogens summed into heavy atoms:
elementType: O N N C C C C C C C C C C C C C
charge: -0.296348 -0.143939 -0.171723 -0.094638 -0.088245 0.596379 0.602342 0.269554 -0.132401 -0.144902 0.022314 -0.284784 -0.276241 0.513046 -0.102016 -0.268398
polarizability: 1.92908688e+02 2.33574633e+01 1.51179624e+02 3.71952929e+00 8.63848746e+00 1.35744612e+02
1716.lowfreq: -11.8369 -2.7064 -0.0005 -0.0003 0.0005 1.5921 21.0258 24.2881 35.1177
frequency: 20.1629 23.7442 34.9033 40.0283 52.4125 54.2862 71.9760 85.8082 105.7490 125.5681 165.3932 175.1303 187.1131 206.9783 227.8080 264.9719 285.3256 317.4406 370.4609 393.2088 396.9841 407.1835 416.5378 438.7725 467.7098 480.6121 538.8872 581.3790 608.1100 642.3430 672.7566 687.9174 701.1452 727.7353 795.0416 809.9655 815.2201 844.6235 901.0592 925.4302 937.3368 947.1333 953.5660 955.3291 964.2386 967.7726 974.6085 978.1994 1004.1922 1016.5128 1019.4173 1036.5784 1045.8050 1050.2359 1062.3455 1098.4494 1166.3065 1199.1933 1207.9130 1265.6332 1287.6368 1300.5710 1306.2275 1339.4174 1340.7396 1350.2943 1381.7248 1387.9877 1390.2784 1393.2550 1428.3031 1430.5866 1433.4989 1445.5700 1454.8716 1457.2355 1462.7606 1467.7787 1470.3130 1478.0414 1479.3244 1480.7323 1639.3153 1672.5292 1674.7167 1677.8976 2932.1762 2959.9586 2962.9200 2974.1705 2987.4108 2998.5692 3029.0848 3034.8215 3039.5871 3054.8645 3074.0165 3079.3208 3083.5403 3086.4152 3088.0363 3089.5672 3093.0369 3096.1700 3191.6454 3196.8405 3197.0144 3452.3563
redmass: 2.8956 3.5353 3.2274 2.9395 3.5777 3.2804 3.2986 6.4797 3.2275 2.9474 1.1746 3.5567 1.0654 1.0517 3.4498 3.5894 4.0144 3.7615 2.7983 2.1148 2.0427 2.2780 2.2600 2.0704 2.2629 2.6427 3.2200 2.4702 2.6260 1.1810 2.8428 1.3575 1.1593 1.6065 3.1177 3.5151 3.3108 3.1513 2.9251 1.6286 1.5882 1.3735 1.3747 1.3179 1.3485 1.6556 1.7575 1.6335 3.1167 1.5382 1.5198 1.4991 1.5401 1.5807 1.6507 2.0350 2.4617 1.1703 1.5936 2.3114 3.3488 2.2564 2.0643 1.2091 1.5560 1.2316 1.9082 1.2369 1.2611 1.2471 1.1530 1.1700 1.1724 1.0972 1.0537 1.0955 1.0508 1.0764 1.0897 1.0627 1.0621 1.0728 6.1827 5.0741 5.1117 5.1213 1.0622 1.0380 1.0383 1.0385 1.0639 1.0637 1.0990 1.0958 1.0955 1.0942 1.0985 1.0977 1.0980 1.0940 1.0668 1.0631 1.0648 1.0982 1.1141 1.1141 1.1140 1.0772
irintensity: 0.0502 0.2605 0.1076 0.0328 0.1867 0.1138 1.4164 0.9217 0.3710 2.1346 0.4231 1.1005 0.2081 0.4483 3.4874 2.2906 9.8593 5.3125 0.7384 5.0615 2.5332 7.9693 6.2940 0.7679 3.0595 8.8338 6.5011 13.7998 35.4515 77.1596 5.0269 9.6479 0.7373 3.3015 27.2101 3.3145 8.6522 13.3375 5.4512 26.6313 26.9165 84.3100 67.9346 43.8575 15.2714 17.6917 20.0969 14.2032 219.8262 31.4907 48.0917 13.1425 19.2179 0.5290 10.6078 81.5814 36.1011 41.0643 197.3191 58.3003 1.9340 5.1430 28.3098 4.3776 19.9650 7.3696 75.0518 22.7681 8.7537 29.1279 8.0474 1.7573 0.8851 18.5409 12.3118 7.4823 15.6897 31.2821 14.4817 0.5392 46.0310 14.3069 315.8811 12.0612 19.7958 17.9415 36.3508 27.4871 25.8313 22.4059 30.1361 55.2099 25.1786 27.4768 22.9389 18.7513 8.2460 12.2092 49.2051 27.8911 1.8406 8.5432 11.6474 21.9610 23.8726 18.1695 23.3729 10.7687
temp: 298.150 k
press: 1.00000 atm
elementType: 8 7 7 6 6 6 6 6 6 6 6 6 6 6 6 6 1 1 1 1 1 1 1 1 1 1 1 1 1 1 1 1 1 1 1 1 1 1
symmnumber: 1
zpe: 850854.6 jmol-1
zpe.correction: 0.324073 hartree
zpe.thermalcorrener: 0.343884 hartree
zpe.thermalcorrenthalpy: 0.344828 hartree
zpe.thermalcorrgfe: 0.272881 hartree
zpe.sumelectzpe: -691.962170 hartree
zpe.sumelectthermal: -691.942360 hartree
zpe.sumelectthermalent: -691.941416 hartree
zpe.sumelectthermalfe: -692.013363 hartree
dipole: 1.2856 0.4059 1.1928
dipole: 1.8001
quadrupole: -93.3241 -96.7308 -98.5525
quadrupole: -5.3748 -4.1347 -2.5336
quadrupole: 2.8784 -0.5284 -2.3501 -5.3748 -4.1347 -2.5336
hfenergy: -692.2862437 hartree
pointgroup: C01 [X(C13H22N2O1)]
dipole: -0.5186907 -0.1988513 0.4393072 debye
polarizability: 193.0589828|23.695773|152.4593292|-0.0501631|-6.5069958|134.3146116 unknown
InChI: InChI=1S/C13H22N2O/c1-10(2)7-15(8-11(3)4)13(14)16-9-12(5)6/h14H,1,3,5,7-9H2,2,4,6H3
charge 0 multiplicity 1
38 atoms
O  -1.16088 0.452064 -0.053224
N  1.044422 -0.218817 -0.056851
N  0.449532 1.438643 -1.633075
C  0.61923 -1.360152 0.791021
C  2.47788 -0.02924 -0.397594
C  0.120227 -2.574663 0.001023
C  3.167128 1.039919 0.452396
C  0.121364 0.625717 -0.660855
C  1.089383 -3.181621 -0.996474
C  3.261308 0.767693 1.942616
C  -2.289718 1.155583 -0.701417
C  -1.126997 -3.070549 0.208386
C  3.663091 2.165112 -0.123734
C  -3.529943 0.902162 0.130937
C  -3.456663 1.324965 1.584068
C  -4.639352 0.361075 -0.436257
H  -0.165398 -1.027396 1.489578
H  1.503404 -1.65209 1.390899
H  2.546033 0.243893 -1.463763
H  2.98114 -1.004725 -0.24921
H  0.645413 -4.046695 -1.517863
H  2.02061 -3.519929 -0.498859
H  1.383324 -2.435497 -1.759237
H  3.773757 1.587845 2.474061
H  3.812977 -0.172334 2.146719
H  2.252011 0.65327 2.383482
H  -2.065401 2.245013 -0.728267
H  -2.412922 0.786574 -1.737466
H  -1.492727 -3.953641 -0.329215
H  -1.822101 -2.594786 0.910047
H  4.175619 2.936458 0.464311
H  3.544886 2.349804 -1.197057
H  -0.289981 2.081767 -1.953665
H  -4.403241 1.125367 2.11368
H  -2.640599 0.7859 2.098938
H  -3.227932 2.40549 1.672148
H  -5.561122 0.212565 0.13757
H  -4.657564 0.049456 -1.487297
