program: Gaussian 09
title: 000234183
version: EM64L-G09RevD.01
frameworkgroup: C1[X(C8H12O3)]
method: RPBEPBE
basis: SDD
operation: Freq
keyword: #pfreq=noraman
keyword: PBEPBE/SDD
title: #p freq=noraman PBEPBE/SDD
converged: YES YES NO NO
title: Mulliken charges:
elementType: O O O C C C C C C C C H H H H H H H H H H H H
charge: -0.278294 -0.222736 -0.250716 -0.004066 -0.503062 -0.508138 0.197792 0.234164 -0.753659 -0.259629 -0.666582 0.266102 0.289855 0.272673 0.281200 0.244899 0.230372 0.266905 0.238592 0.224811 0.221868 0.225183 0.252465
chargesum: 0.00000
title: Mulliken charges with hydrogens summed into heavy atoms:
elementType: O O O C C C C C C C C
charge: -0.278294 -0.222736 -0.250716 -0.004066 0.052895 0.045735 0.197792 0.234164 -0.011484 0.203774 0.032934
polarizability: 1.13136419e+02 5.46243906e+00 9.56327021e+01 1.14390863e+00 -2.06025204e+00 7.20967708e+01
1716.lowfreq: -8.7160 -1.4211 -0.0005 -0.0004 -0.0002 6.6979 33.4520 45.9132 65.5968
frequency: 33.4227 45.8993 65.5957 90.5955 131.9550 169.6219 222.7611 234.0651 259.0153 268.7558 324.8394 361.0576 387.6679 428.1176 466.3145 586.4249 595.6878 697.4197 716.2974 785.0743 796.3710 808.5670 820.5367 876.1980 930.0393 972.3073 980.3390 1015.5597 1032.6889 1067.8097 1091.0319 1099.3744 1100.1181 1154.1342 1164.5452 1188.6676 1278.1141 1294.2682 1304.4271 1356.9725 1371.2333 1391.1716 1414.9762 1435.2331 1440.3025 1449.6666 1456.4899 1464.2175 1484.9207 1596.9086 1620.8148 2993.4795 2996.5458 3032.1621 3087.5988 3087.9346 3095.1147 3107.0886 3111.3489 3120.8914 3125.5775 3217.2210 3234.3853
redmass: 3.7937 4.4892 3.6764 3.7708 1.4260 1.5824 1.5926 2.8084 2.2063 2.6164 3.3169 4.4784 4.0313 5.4824 4.1310 2.7715 3.7084 7.1183 3.3080 3.1394 1.6160 1.2558 2.2737 2.1352 3.3050 1.2586 1.8890 2.8992 1.7735 1.1904 2.3025 2.0374 1.4825 1.6757 3.5976 1.3172 1.1247 3.4461 4.1919 1.3483 1.2437 1.2325 1.0869 1.2433 1.1181 1.0615 1.0996 1.0438 1.0509 8.0691 8.6122 1.0361 1.0359 1.0595 1.0975 1.0958 1.1028 1.0494 1.0609 1.1063 1.1018 1.1188 1.1171
irintensity: 0.4785 7.0453 1.9292 0.2464 1.8323 0.4768 1.7573 7.0562 1.3064 4.8194 15.2677 4.3541 11.1852 2.1085 7.9659 4.3977 10.6513 5.0089 4.9571 0.7280 2.7109 7.1346 14.7126 13.4879 5.5120 3.1390 11.5307 42.4055 6.4818 8.8878 181.0307 32.0527 36.9345 23.4496 146.9776 0.0185 4.8221 162.5399 106.5768 13.2669 52.1311 27.4746 18.2276 16.6486 37.8041 18.8096 20.1026 16.0891 13.5143 225.7458 59.7150 16.7858 4.1516 29.1699 34.7579 9.2037 2.2593 8.9510 2.9234 28.2606 15.8301 0.0419 0.5052
temp: 298.150 k
press: 1.00000 atm
elementType: 8 8 8 6 6 6 6 6 6 6 6 1 1 1 1 1 1 1 1 1 1 1 1
symmnumber: 1
zpe: 487705.2 jmol-1
zpe.correction: 0.185757 hartree
zpe.thermalcorrener: 0.198093 hartree
zpe.thermalcorrenthalpy: 0.199037 hartree
zpe.thermalcorrgfe: 0.146273 hartree
zpe.sumelectzpe: -536.835209 hartree
zpe.sumelectthermal: -536.822873 hartree
zpe.sumelectthermalent: -536.821929 hartree
zpe.sumelectthermalfe: -536.874693 hartree
dipole: 2.9632 0.5288 0.2573
dipole: 3.0210
quadrupole: -66.4724 -68.2561 -63.8389
quadrupole: 8.3508 -4.3915 3.2334
quadrupole: -0.2833 -2.0670 2.3503 8.3508 -4.3915 3.2334
hfenergy: -537.0209659 hartree
pointgroup: C01 [X(C8H12O3)]
dipole: -1.1262512 0.2601325 -0.2765991 debye
dipolederiv: -1.3171829 0.4363109 0.0116052 0.4852385 -0.7451054 -0.0964499 0.1910384 -0.1850845 -0.3724843 -0.813607 -0.2243494 -0.2357416 -0.1236601 -0.6028916 0.0080916 -0.2176306 -0.0150161 -0.4235975 -0.7498506 -0.1930509 -0.1161948 -0.0240671 -0.797537 -0.2006111 -0.0217953 -0.2108679 -0.3879091 -0.6503844 0.2052385 -0.1271021 0.1497366 -0.8285357 -0.020939 -0.2013587 -0.035522 -0.0147731 0.1049889 -0.1176664 0.0342028 -0.1659361 0.1002894 -0.0352181 -0.1192408 0.173223 -0.0513516 0.0217136 -0.1287794 -0.0274199 -0.0947159 0.1821357 0.0178347 0.1589432 -0.1820973 -0.0393515 0.7464193 0.3018419 0.3459094 0.2166595 1.2914967 -0.0974424 0.3531322 -0.0787323 0.3162033 1.7210428 -0.1907813 0.1042499 -0.443638 1.0961643 0.3512937 -0.0747473 0.4457264 0.3517311 -0.1420412 0.2174167 -0.1026826 0.1840867 -0.3298597 0.131512 -0.0685863 0.1100034 -0.0238411 0.879266 -0.1836651 0.0388832 -0.0222206 0.2279424 -0.034246 0.0493822 -0.0038474 0.3387561 -0.1065299 0.0591944 -0.0414593 0.0193166 0.0509502 0.0447613 -0.0690423 0.0145869 -0.1325571 0.0527706 -0.0589509 0.0428238 -0.0610237 0.0128108 0.0662018 0.0181873 0.0482431 0.0568717 0.0294009 -0.0016074 -0.0745506 0.0012075 0.1081496 -0.0186789 -0.0329785 0.0117235 0.0460034 -0.0260747 -0.0229647 0.0712854 -0.0333091 0.0755058 0.0162941 0.0447052 -0.0075454 0.0633512 0.0982372 -0.0272384 -0.0284243 -0.0316376 0.0264378 -0.0712414 -0.0002145 -0.0433764 0.0462454 -0.0003537 -0.1341708 0.0118761 -0.0729144 -0.0331421 0.0361849 -0.0155201 0.0385325 0.1019706 0.0981715 -0.0243637 -0.0684432 -0.0101175 0.0522749 -0.0789725 -0.101458 -0.0353526 -0.05325 0.0579436 0.0499985 0.0722322 0.0625694 0.1252344 0.0126751 0.0809498 -0.0171731 0.045108 -0.0105282 0.0222809 -0.007789 -0.0959147 -0.0573037 0.0914681 -0.0293961 0.0462874 0.0511856 -0.0178067 0.0476494 0.0135755 0.0703714 0.0296969 -0.1094755 0.0399693 -0.0780047 -0.0577536 -0.1860303 0.0058851 -0.0137958 -0.0036315 0.1101763 0.0113945 -0.0245391 0.0263738 0.0985989 0.1064184 -0.0891822 0.0199981 -0.0541776 -0.1112788 0.0682389 -0.0057566 0.0363862 0.0533321 0.1040167 0.0509546 0.0769616 0.0477777 0.016389 -0.092676 0.0459565 -0.0584666 -0.0124885 unknown
polarizability: 111.299188|-6.3395191|96.3005882|7.2252306|0.2889435|73.2661151 unknown
InChI: InChI=1S/C8H12O3/c1-3-11-7(10)8(4-5-8)6(2)9/h3-5H2,1-2H3
charge 0 multiplicity 1
23 atoms
O  -1.269483 0.361862 0.507412
O  2.754894 1.027603 0.818114
O  -0.997734 -1.771349 -0.389458
C  0.973899 -0.473087 0.232983
C  1.68572 -1.597804 1.059277
C  1.897485 -1.554706 -0.43068
C  1.603665 0.905284 0.309407
C  -0.495594 -0.705684 0.049138
C  0.895284 2.098827 -0.308767
C  -2.755727 0.189718 0.420326
C  -3.271878 0.576676 -0.967945
H  1.035324 -2.375435 1.467131
H  2.489785 -1.230542 1.702335
H  2.855871 -1.18216 -0.801192
H  1.37521 -2.286867 -1.051752
H  1.615446 2.924613 -0.416995
H  0.454571 1.842234 -1.28899
H  0.060426 2.414589 0.340464
H  -2.998579 -0.859876 0.660959
H  -3.135114 0.860335 1.207723
H  -4.376307 0.522427 -0.981034
H  -2.975909 1.607796 -1.228221
H  -2.885655 -0.114256 -1.735635
