program: Gaussian 09
title: 000234179
version: EM64L-G09RevD.01
frameworkgroup: C1[X(C16H30O3)]
method: RPBEPBE
basis: SDD
operation: Freq
keyword: #pfreq=noraman
keyword: PBEPBE/SDD
title: #p freq=noraman PBEPBE/SDD
converged: YES YES NO NO
title: Mulliken charges:
elementType: O O O C C C C C C C C C C C C C C C C H H H H H H H H H H H H H H H H H H H H H H H H H H H H H H
charge: -0.273829 -0.254500 -0.195648 0.023816 -0.497566 -0.004638 -0.424295 -0.436774 -0.036709 -0.030492 -0.773130 -0.718006 -0.720445 -0.718289 -0.717122 0.278095 -0.593485 0.223171 -0.757525 0.227622 0.215634 0.206397 0.252810 0.193111 0.190060 0.223245 0.211236 0.205905 0.207885 0.206940 0.224508 0.222987 0.212605 0.213187 0.206057 0.211327 0.219322 0.207452 0.220128 0.211988 0.215922 0.211451 0.216414 0.214370 0.236234 0.275784 0.232710 0.283299 0.250783
chargesum: 0.00000
title: Mulliken charges with hydrogens summed into heavy atoms:
elementType: O O O C C C C C C C C C C C C C C C C
charge: -0.273829 -0.254500 -0.195648 0.251438 -0.075535 0.248171 -0.041124 -0.002293 0.169195 0.177393 -0.118695 -0.086157 -0.082344 -0.070252 -0.074888 0.278095 -0.081468 0.223171 0.009267
polarizability: 2.04352910e+02 -4.01879850e+00 1.87042576e+02 1.79615300e+00 5.63828040e-01 1.63068197e+02
1716.lowfreq: -21.5138 -5.0485 -4.3401 -0.0007 -0.0006 0.0007 5.1827 9.3032 24.9772
frequency: -19.0055 8.1879 24.1764 26.2843 31.9305 45.1007 51.8306 64.3687 67.4419 96.6541 122.1667 140.7515 150.0246 161.2302 188.3944 205.3730 209.0225 215.7878 227.3282 234.4954 242.7488 252.9684 267.3932 295.4504 325.5637 348.6708 377.6919 387.2397 398.1489 407.7534 413.7564 459.8043 465.2306 471.7429 484.8644 515.8303 558.5105 596.1604 708.7520 756.9686 801.2316 804.4506 810.4165 824.9513 845.3249 872.7508 880.3082 906.9781 912.9945 916.3440 921.1913 926.5658 952.9778 955.0578 958.4767 975.9515 1004.2980 1010.8980 1026.9056 1030.7442 1077.2277 1081.9693 1100.2195 1106.8217 1142.5647 1154.8663 1164.2877 1171.1947 1178.0687 1179.5855 1184.4336 1214.8248 1224.1740 1227.0060 1260.4455 1272.0401 1277.8778 1285.0651 1297.5883 1316.2085 1322.7718 1328.9688 1333.9836 1343.8476 1348.1055 1356.1754 1364.3020 1373.1133 1374.7452 1380.3811 1390.5432 1392.3916 1396.6300 1431.6075 1444.6677 1446.8330 1454.7608 1456.9703 1458.2964 1466.8410 1469.0378 1469.8448 1472.0331 1475.8070 1481.4030 1482.6759 1487.7318 1488.7232 1492.8131 1611.3807 1646.4637 2937.4493 2964.5360 2965.4289 2965.8147 2968.7885 2969.1449 2969.8588 2971.2902 2971.9386 2976.9402 2979.3122 2983.9514 3002.9937 3015.9388 3025.0604 3033.4476 3053.9966 3056.9127 3061.5133 3062.5026 3063.4551 3064.1396 3066.5388 3067.4188 3069.2843 3070.3583 3072.6075 3073.0969 3124.6301 3127.1759
redmass: 2.7079 3.7097 2.6759 5.5041 5.9931 4.5017 3.1173 3.5440 3.2052 2.5075 2.7774 3.1675 1.0551 2.4931 2.5162 1.1986 1.1456 2.7881 1.3030 1.3634 1.2377 1.6639 4.0958 2.3857 2.4545 2.5768 2.1336 2.0893 2.2529 2.4364 2.1223 2.8878 2.8508 2.2538 3.3691 3.3510 2.8442 4.2184 5.0026 2.9837 2.7320 2.7743 2.9257 2.3465 1.5043 1.8139 1.6728 1.6860 1.2327 1.3064 2.4452 2.0844 1.6394 1.4051 1.6405 1.7456 1.9858 1.9306 1.5124 1.8333 2.8434 1.6580 1.9444 2.0469 2.2556 2.4546 2.0573 2.1844 1.8279 1.8546 2.4629 1.4435 1.7032 1.4932 1.3459 1.2358 1.5156 1.2470 1.2771 1.3876 1.3323 1.4379 1.3324 1.4033 1.5090 1.3925 1.5752 1.2629 1.2245 1.2096 1.2101 1.2180 1.2125 1.0878 1.0860 1.0592 1.0726 1.0847 1.0806 1.0488 1.0472 1.0530 1.0560 1.0599 1.0531 1.0551 1.0492 1.0481 1.0468 9.5215 7.8126 1.0588 1.0460 1.0660 1.0706 1.0389 1.0354 1.0550 1.0542 1.0419 1.0576 1.0378 1.0837 1.0971 1.0625 1.0955 1.1004 1.0933 1.0994 1.0981 1.0992 1.0946 1.0992 1.0991 1.0988 1.0988 1.0990 1.0978 1.0987 1.0994 1.1009
irintensity: 0.1110 2.0988 0.1016 0.7649 1.3687 2.5481 0.3736 1.6601 1.6383 0.2341 0.0320 0.9299 0.3173 1.2350 4.2708 1.0690 0.1781 6.1698 0.2950 1.0769 0.4345 0.0932 3.3112 0.5127 1.5643 0.4954 1.8474 0.7138 0.4342 0.7317 1.5259 1.5717 3.2410 2.0141 22.9121 2.7658 2.0286 11.6322 3.0704 9.7535 3.5007 3.0827 1.6579 2.1158 12.6944 2.0013 17.7956 26.4553 3.0306 3.8699 35.3094 6.5391 5.2857 0.0664 3.3820 11.1851 17.9041 11.1672 16.3890 4.1325 2.9448 33.1852 257.0304 0.4079 11.6466 5.7506 53.9248 2.2581 22.8039 4.8849 283.0196 0.3577 56.2390 8.1164 2.1340 4.9449 124.5216 3.8990 3.4070 7.4613 0.8853 2.0665 4.6633 1.9271 2.9843 5.2560 2.3829 85.6914 18.2910 17.3200 18.9353 16.2573 19.8276 15.9127 3.3813 30.4807 24.5236 1.3294 0.8066 1.9337 0.7120 9.6070 5.9323 6.3531 8.9502 8.0931 17.8365 22.5594 20.1925 206.3450 105.9119 29.8676 35.0247 8.6598 17.4164 15.8268 33.9394 49.4153 10.6624 21.3424 24.4745 6.9468 13.8533 37.4926 3.5297 22.0677 14.9447 29.7501 9.2035 19.3221 22.0716 5.7033 65.7346 54.0951 59.6357 85.0161 63.2890 61.5075 60.2512 6.2930 5.1872
temp: 298.150 k
press: 1.00000 atm
elementType: 8 8 8 6 6 6 6 6 6 6 6 6 6 6 6 6 6 6 6 1 1 1 1 1 1 1 1 1 1 1 1 1 1 1 1 1 1 1 1 1 1 1 1 1 1 1 1 1 1
symmnumber: 1
zpe: 1127124.2 jmol-1
zpe.correction: 0.429299 hartree
zpe.thermalcorrener: 0.453133 hartree
zpe.thermalcorrenthalpy: 0.454077 hartree
zpe.thermalcorrgfe: 0.372322 hartree
zpe.sumelectzpe: -851.829583 hartree
zpe.sumelectthermal: -851.805749 hartree
zpe.sumelectthermalent: -851.804805 hartree
zpe.sumelectthermalfe: -851.886560 hartree
dipole: -2.2087 0.7545 1.4678
dipole: 2.7572
quadrupole: -124.9222 -112.4866 -128.3810
quadrupole: 1.1479 7.4834 -8.3095
quadrupole: -2.9922 9.4433 -6.4511 1.1479 7.4834 -8.3095
hfenergy: -852.2588819 hartree
pointgroup: C01 [X(C16H30O3)]
dipole: 0.8220149 0.0859098 -0.7025708 debye
polarizability: 204.8055916|1.6436673|185.2935085|-3.3700454|-5.1388277|164.3645826 unknown
InChI: InChI=1S/C16H30O3/c1-11(2)7-13(5)9-15(8-12(3)4)19-16(18)10-14(6)17/h11-13,15H,7-10H2,1-6H3
charge 0 multiplicity 1
49 atoms
O  -0.666809 -0.366573 0.669579
O  -2.342033 -0.540207 -0.949636
O  -3.890078 -1.775215 2.681037
C  2.181361 -0.356734 -0.261982
C  1.396108 0.858266 0.303744
C  -0.106338 0.87287 -0.00569
C  3.615043 -0.355927 0.33571
C  -0.873398 2.083281 0.561664
C  4.538447 -1.538422 -0.064923
C  -0.460431 3.460923 -0.027963
C  2.203315 -0.352251 -1.809633
C  5.929432 -1.364866 0.591089
C  3.929441 -2.909999 0.313597
C  -0.625558 3.516808 -1.566482
C  -1.289093 4.579103 0.648309
C  -1.785656 -0.951375 0.099295
C  -2.24223 -2.150943 0.926724
C  -3.686013 -1.967349 1.456359
C  -4.80059 -2.047837 0.430029
H  1.659671 -1.272704 0.08103
H  1.521511 0.899229 1.404595
H  1.836762 1.791436 -0.102656
H  -0.311058 0.763036 -1.085428
H  3.534311 -0.34345 1.444239
H  4.116254 0.594484 0.049229
H  -1.954007 1.9315 0.36866
H  -0.735312 2.100293 1.661143
H  4.681476 -1.515805 -1.165337
H  0.607627 3.641893 0.214042
H  2.741747 0.537931 -2.190613
H  2.712174 -1.248019 -2.208359
H  1.184427 -0.34278 -2.237965
H  6.386261 -0.395995 0.314275
H  6.622143 -2.169323 0.28092
H  5.847606 -1.397063 1.695019
H  4.625012 -3.732384 0.062137
H  2.978341 -3.102695 -0.215602
H  3.72707 -2.959251 1.401423
H  -1.664917 3.271722 -1.857253
H  -0.397211 4.530174 -1.945452
H  0.045343 2.808599 -2.087049
H  -2.366548 4.457072 0.425737
H  -1.167237 4.563108 1.747487
H  -0.980262 5.57679 0.285207
H  -2.221496 -3.037223 0.264572
H  -1.561984 -2.29971 1.777518
H  -4.892682 -3.090113 0.065882
H  -4.554484 -1.424315 -0.448704
H  -5.757763 -1.738494 0.876475
