program: Gaussian 09
title: 000234162
version: EM64L-G09RevD.01
frameworkgroup: C1[X(C17H21NO2)]
method: RPBEPBE
basis: SDD
operation: Freq
keyword: #p
keyword: freq=noraman
keyword: PBEPBE/SDD
title: #p freq=noraman PBEPBE/SDD
converged: NO YES NO NO
title: Mulliken charges:
elementType: O O N C C C C C C C C C C C C C C C C C H H H H H H H H H H H H H H H H H H H H H
charge: -0.465958 -0.513095 -0.142668 -0.331165 -0.467477 -0.347158 0.481484 0.447564 -0.300813 -0.349411 -0.458767 -0.436294 -0.355298 -0.374924 -0.229911 -0.223934 -0.241512 -0.245678 -0.244875 -0.245897 0.210464 0.245401 0.239323 0.245512 0.232120 0.179489 0.216008 0.207889 0.215489 0.231664 0.229106 0.241306 0.257954 0.224731 0.223005 0.223255 0.222458 0.226966 0.226636 0.379445 0.367564
chargesum: 0.00000
title: Mulliken charges with hydrogens summed into heavy atoms:
elementType: O O N C C C C C C C C C C C C C C C C C
charge: -0.086512 -0.145531 -0.142668 -0.120701 0.017246 0.130474 0.481484 0.447564 0.094683 0.073967 -0.227103 -0.207188 -0.113992 -0.116970 -0.005180 -0.000929 -0.018256 -0.023220 -0.017908 -0.019262
polarizability: 1.83147000e+02 5.05652150e-01 2.16025488e+02 3.95885409e+00 7.65079012e+00 1.73545270e+02
1716.lowfreq: -2.0353 -0.0005 -0.0003 0.0005 5.5947 11.8561 25.1216 45.9274 49.5256
frequency: 24.8112 45.9233 49.5098 55.5952 72.8877 81.2866 117.6223 123.2052 169.1455 196.8353 201.9822 215.2658 229.0866 237.8559 264.1768 275.4026 299.6608 325.8247 397.2954 402.7640 410.4335 426.7538 477.7708 512.7789 538.4922 569.1591 607.4693 616.9858 618.8619 640.1546 700.5716 712.1555 733.0628 751.1015 754.5167 778.6024 825.4294 833.0104 849.7181 853.0487 861.7072 868.7184 892.9141 922.4900 934.9809 975.3508 980.4628 985.0249 989.8092 991.9214 993.8532 1000.0342 1007.0259 1023.4968 1026.8356 1027.9287 1055.5668 1065.7033 1073.1195 1085.5013 1113.5019 1148.9799 1169.0863 1171.1797 1178.5864 1184.1352 1188.3551 1197.5850 1203.5072 1217.1761 1220.2518 1259.0942 1290.8337 1297.1034 1310.0998 1335.0248 1338.3224 1354.9315 1368.8956 1379.0685 1385.3010 1387.4809 1406.1501 1424.2731 1439.9723 1441.4732 1464.2575 1465.9573 1473.1717 1476.8545 1480.2210 1481.7403 1592.9684 1594.5677 1608.1209 1612.4316 2866.5591 2916.6692 2925.8543 2967.6908 3012.2079 3029.6874 3035.3295 3036.6083 3069.8094 3112.6267 3114.3520 3120.0376 3123.7931 3133.7160 3136.9593 3143.5153 3149.1501 3160.5574 3162.8837 3313.3835 3599.2690
redmass: 4.0128 4.7592 4.6104 4.0371 4.5714 4.4427 3.4257 4.8408 4.2198 3.6993 1.9349 1.7151 3.5190 4.2790 4.2535 3.3334 3.4910 3.5301 3.2862 2.8347 2.8814 2.2584 3.3878 2.7154 2.9671 2.2826 5.2685 6.3273 5.9280 4.4094 1.8459 1.7013 1.1015 2.5182 1.8777 3.0182 3.2948 3.0800 1.8815 1.5695 1.2889 3.0154 2.1189 1.4758 1.4916 1.4011 2.1872 1.4375 5.7994 4.5320 1.3423 1.4322 2.5384 2.5782 2.3920 2.2218 2.7079 2.0085 1.5975 1.6038 2.0112 2.6387 1.0810 1.0702 1.1869 1.6015 1.4290 2.1213 1.1359 1.3844 1.1928 1.4482 1.3550 1.3789 1.2083 1.3124 1.2750 1.2232 1.2155 1.8188 5.6396 2.5542 1.5403 1.1692 2.1018 2.1178 1.0888 1.0790 1.0902 2.0970 1.3537 1.7062 6.0020 6.1888 6.1419 6.1423 1.0812 1.0709 1.0695 1.0559 1.0611 1.1059 1.0910 1.0918 1.1008 1.0872 1.0865 1.0862 1.0861 1.0909 1.0916 1.0958 1.0949 1.1013 1.1011 1.0687 1.0668
irintensity: 0.6531 2.7108 0.9027 2.3250 0.4847 0.3406 15.4569 8.8836 3.6330 24.0508 44.8421 73.9626 12.0601 0.9017 0.7314 2.4371 0.7906 3.2191 1.4526 0.1215 0.1277 7.4015 3.9418 19.7950 8.4551 2.5823 5.4928 0.5789 3.5163 14.5624 23.9753 85.4192 125.4153 13.7582 39.3946 31.0562 3.1400 17.3356 1.8373 1.7053 4.1514 72.0026 6.3285 3.3855 16.3177 0.5894 13.9113 0.6426 0.3726 0.0437 0.8243 23.0166 80.6386 4.4947 33.4523 0.7335 6.7496 37.1568 1.2014 27.7656 8.2277 60.6729 2.0221 0.6508 6.9138 7.8696 3.7663 0.7831 14.1484 13.4282 9.5605 0.4616 22.6360 3.1576 19.1936 1.7318 4.9695 4.3531 5.8651 0.7837 0.1691 1.2170 7.7720 45.3136 9.8056 12.9316 13.6888 4.5227 7.4146 21.2772 6.9377 7.5762 0.1237 1.9365 12.8559 1.6078 41.4031 94.0144 54.0892 49.7056 35.6718 35.3502 38.5084 39.9847 39.9104 7.6151 7.6395 0.4723 0.4590 11.1167 26.2953 24.0585 38.5963 34.6735 21.0897 258.1189 9.6638
temp: 298.150 k
press: 1.00000 atm
elementType: 8 8 7 6 6 6 6 6 6 6 6 6 6 6 6 6 6 6 6 6 1 1 1 1 1 1 1 1 1 1 1 1 1 1 1 1 1 1 1 1 1
symmnumber: 1
zpe: 900488.8 jmol-1
zpe.correction: 0.342978 hartree
zpe.thermalcorrener: 0.361837 hartree
zpe.thermalcorrenthalpy: 0.362782 hartree
zpe.thermalcorrgfe: 0.294910 hartree
zpe.sumelectzpe: -864.081042 hartree
zpe.sumelectthermal: -864.062182 hartree
zpe.sumelectthermalent: -864.061238 hartree
zpe.sumelectthermalfe: -864.129110 hartree
dipole: -0.4819 -1.9064 -2.8276
dipole: 3.4441
quadrupole: -112.9751 -109.8210 -114.7927
quadrupole: 10.3222 15.0340 1.5046
quadrupole: -0.4455 2.7086 -2.2631 10.3222 15.0340 1.5046
hfenergy: -864.4240197 hartree
pointgroup: C01 [X(C17H21N1O2)]
dipole: -0.617412 -0.0422402 -1.2054534 debye
polarizability: 208.9031331|10.4010284|187.3628055|13.7239975|1.2405498|176.4518199 unknown
InChI: InChI=1S/C17H21NO2/c19-13-11-18(12-14-20)17(15-7-3-1-4-8-15)16-9-5-2-6-10-16/h1-10,17,19-20H,11-14H2
charge 0 multiplicity 1
41 atoms
O  -0.714141 3.607317 1.657125
O  -2.367439 3.825454 -0.50777
N  -0.58367 1.159649 -0.324148
C  -0.091191 0.029226 0.528264
C  0.290478 2.368794 -0.306845
C  -2.02789 1.425017 -0.05317
C  1.412862 -0.229976 0.334377
C  -0.865617 -1.270453 0.232433
C  0.512792 3.091954 1.047111
C  -2.675608 2.451288 -0.984996
C  2.272759 -0.271392 1.457806
C  -1.140163 -2.17776 1.283966
C  1.958665 -0.474154 -0.951981
C  -1.262801 -1.612631 -1.085009
C  3.650509 -0.552622 1.306083
C  -1.78904 -3.407293 1.028183
C  3.333897 -0.746956 -1.108922
C  -1.915064 -2.837297 -1.344226
C  4.186434 -0.790303 0.020649
C  -2.177902 -3.742986 -0.288953
H  -0.246229 0.261404 1.611482
H  -0.136675 3.092646 -1.022865
H  1.281307 2.075951 -0.698851
H  -2.212042 1.733821 1.001373
H  -2.566188 0.473071 -0.212713
H  1.238082 3.919105 0.866683
H  0.965144 2.413435 1.792542
H  -3.774072 2.304676 -0.965102
H  -2.304458 2.315288 -2.020892
H  1.862116 -0.082821 2.457961
H  -0.840757 -1.92266 2.308531
H  1.301015 -0.440791 -1.827345
H  -1.07221 -0.896658 -1.89284
H  4.301893 -0.581551 2.186912
H  -1.99305 -4.098716 1.853723
H  3.742313 -0.930652 -2.109406
H  -2.218799 -3.087371 -2.367544
H  5.253782 -1.006712 -0.101252
H  -2.682439 -4.694881 -0.489865
H  -1.337926 3.896391 0.925941
H  -2.891877 4.497846 -1.005351
