program: Gaussian 09
title: 000234157
version: EM64L-G09RevD.01
frameworkgroup: C1[X(C15H16N2)]
method: RPBEPBE
basis: SDD
operation: Freq
keyword: #pfreq=noraman
keyword: PBEPBE/SDD
title: #p freq=noraman PBEPBE/SDD
converged: YES YES NO NO
title: Mulliken charges:
elementType: N N C C C C C C C C C C C C C C C H H H H H H H H H H H H H H H H
charge: -0.150116 -0.095346 0.409816 0.465069 -0.361617 -0.337815 -0.398793 -0.405108 -0.646060 -0.646560 -0.398663 0.262959 -0.357783 -0.381405 -0.220380 -0.204588 -0.254702 0.236822 0.237281 0.221902 0.270819 0.236945 0.218255 0.236817 0.217584 0.238182 0.238108 0.213012 0.238278 0.248564 0.220665 0.223217 0.224640
chargesum: 0.00000
title: Mulliken charges with hydrogens summed into heavy atoms:
elementType: N N C C C C C C C C C C C C C C C
charge: -0.150116 -0.095346 0.409816 0.465069 -0.124795 -0.100534 -0.176891 -0.134289 0.045957 0.047314 -0.185651 0.262959 -0.119505 -0.132841 0.000285 0.018630 -0.030062
polarizability: 4.28946566e+02 -2.12929916e+00 1.59868310e+02 1.63559519e+00 -5.31125077e+00 8.95002859e+01
1716.lowfreq: -9.8165 -3.1518 -0.0006 -0.0001 0.0004 4.6446 34.7184 36.2484 52.9916
frequency: 34.6450 36.2247 52.9693 77.0909 92.2156 112.4260 143.8683 171.2843 195.9587 212.3223 249.7518 259.0725 310.1007 378.4109 396.0886 409.9468 427.0919 453.3665 485.1045 513.4054 521.1820 539.1026 605.2371 613.2229 633.3406 695.6617 718.9922 739.3192 767.5824 805.9809 814.3613 829.2371 835.8355 857.4175 906.7853 940.1085 941.0117 965.8600 975.3417 983.6347 985.6413 989.7019 995.1176 1019.7456 1056.5697 1078.2437 1106.6154 1110.7937 1125.6628 1161.3611 1165.7667 1169.5940 1183.1282 1198.7669 1257.9391 1261.6713 1304.4571 1317.4450 1355.8580 1365.5290 1375.6629 1392.7107 1429.8740 1437.0288 1447.7663 1459.5708 1464.6746 1473.2407 1476.4161 1491.8156 1505.3927 1532.0699 1550.7058 1574.6011 1582.9029 1614.9970 1633.7292 2930.8888 2943.9113 2951.5103 3010.6697 3014.5450 3098.6841 3108.2098 3113.0433 3118.4921 3127.4668 3139.9518 3145.0506 3153.3491 3162.7453 3165.9714 3167.9336
redmass: 4.2855 3.6558 4.6371 2.3288 4.2472 1.5805 3.9203 2.5834 1.1897 4.0687 2.6811 3.3881 4.0132 3.6531 3.7266 2.9163 3.0110 4.5522 3.7916 3.9708 2.9508 2.5654 5.7425 6.3609 7.0533 1.8473 4.5242 3.1202 1.9423 1.3378 5.8959 1.6452 1.2950 3.8026 1.5244 1.6157 2.2751 1.3880 1.7165 2.2619 1.4438 1.6642 2.8913 2.1233 1.4996 1.5273 1.2406 1.3211 1.4853 1.6579 1.4383 1.2216 1.2663 1.4293 2.8066 1.8011 1.4067 1.5177 2.0339 3.7382 6.0368 2.6573 1.2872 2.4215 2.6239 1.2613 1.0422 2.2610 1.0458 1.1024 1.1321 2.7517 7.1141 5.9848 5.9835 6.2006 6.4075 1.0853 1.0368 1.0393 1.0999 1.1024 1.0962 1.0943 1.0893 1.0845 1.0873 1.0934 1.0874 1.0956 1.0932 1.1005 1.0956
irintensity: 1.3670 0.6671 1.1050 0.2167 0.7608 4.4719 1.0751 5.0937 0.1041 0.0487 3.2331 1.3814 6.5664 6.2290 1.2953 1.4122 0.9995 2.9937 6.6938 17.2810 1.7543 33.3761 0.1023 0.1732 0.2054 45.8147 7.8922 9.2019 52.5174 16.6604 8.5263 63.1516 3.3891 14.5321 10.1124 21.0265 12.9097 0.6118 17.1092 0.3344 0.7450 11.7106 0.2582 10.6233 26.4678 11.3661 0.0445 1.0508 14.1067 77.2945 0.0088 25.6711 110.3444 16.3791 24.9114 11.9283 1.3720 15.7495 17.8910 271.9664 3.4510 6.0225 14.9394 7.4434 33.7391 11.4924 0.3263 57.3149 22.4675 4.0238 52.6321 367.6733 135.2594 7.0060 488.4987 65.7794 268.3420 58.8968 103.8620 151.6781 14.6329 69.5451 4.2329 50.9778 10.8965 9.1381 2.7792 27.3915 3.3952 37.3733 25.1484 30.9859 14.8462
temp: 298.150 k
press: 1.00000 atm
elementType: 7 7 6 6 6 6 6 6 6 6 6 6 6 6 6 6 6 1 1 1 1 1 1 1 1 1 1 1 1 1 1 1 1
symmnumber: 1
zpe: 710018.1 jmol-1
zpe.correction: 0.270432 hartree
zpe.thermalcorrener: 0.286148 hartree
zpe.thermalcorrenthalpy: 0.287092 hartree
zpe.thermalcorrgfe: 0.226056 hartree
zpe.sumelectzpe: -689.469085 hartree
zpe.sumelectthermal: -689.453368 hartree
zpe.sumelectthermalent: -689.452424 hartree
zpe.sumelectthermalfe: -689.513461 hartree
dipole: 5.3026 -1.0081 -0.0656
dipole: 5.3980
quadrupole: -67.3542 -91.2920 -106.3053
quadrupole: 3.2149 1.0227 -0.8733
quadrupole: 20.9630 -2.9748 -17.9882 3.2149 1.0227 -0.8733
hfenergy: -689.7395167 hartree
pointgroup: C01 [X(C15H16N2)]
dipole: 2.0848518 0.3054635 -0.2652266 debye
polarizability: 428.9265071|0.8908359|120.0729427|-3.4482682|-35.2901499|129.3157118 unknown
InChI: InChI=1S/C15H16N2/c1-17(2)15-10-8-13(9-11-15)12-16-14-6-4-3-5-7-14/h3-12H,1-2H3
charge 0 multiplicity 1
33 atoms
N  4.927461 -0.124558 0.058651
N  -1.619784 -0.307731 0.329544
C  3.542133 0.032028 -0.008327
C  0.682514 0.346802 -0.143149
C  2.952406 1.156636 -0.674116
C  2.656856 -0.929956 0.589335
C  1.55774 1.30028 -0.733913
C  1.268248 -0.770596 0.519947
C  5.812172 0.874516 -0.555355
C  5.507717 -1.282589 0.752934
C  -0.766983 0.525326 -0.226332
C  -3.019616 -0.154965 0.154261
C  -3.617786 0.28649 -1.063726
C  -3.865588 -0.525774 1.237545
C  -5.021657 0.37854 -1.175841
C  -5.265983 -0.416289 1.123341
C  -5.853514 0.037779 -0.083229
H  3.584484 1.916289 -1.141985
H  3.063766 -1.802811 1.107643
H  1.132081 2.171618 -1.248937
H  0.596626 -1.504949 0.977169
H  5.641235 0.958372 -1.647652
H  6.861715 0.580352 -0.3990
H  5.669227 1.879532 -0.108871
H  6.606286 -1.228601 0.699262
H  5.190722 -2.239495 0.291554
H  5.219881 -1.307128 1.823355
H  -1.107294 1.432715 -0.772974
H  -2.982956 0.518706 -1.92723
H  -3.395872 -0.888963 2.157442
H  -5.469146 0.706439 -2.12157
H  -5.902659 -0.693882 1.971316
H  -6.942935 0.108766 -0.175594
