program: Gaussian 09
title: 000234149
version: EM64L-G09RevD.01
frameworkgroup: C1[X(C5H12N4O6S2)]
method: RPBEPBE
basis: SDD
operation: Freq
keyword: #p
keyword: freq=noraman
keyword: PBEPBE/SDD
title: #p freq=noraman PBEPBE/SDD
converged: YES YES NO NO
title: Mulliken charges:
elementType: S S O O O O O O N N N N C C C C C H H H H H H H H H H H H
charge: 1.025253 1.025253 -0.485491 -0.507034 -0.485493 -0.507034 -0.235477 -0.235475 -0.274542 -0.274543 0.101397 0.101397 -0.293187 -0.591934 -0.591933 -0.584870 -0.584871 0.278343 0.278342 0.294012 0.320010 0.294009 0.320008 0.268590 0.267662 0.270678 0.270677 0.268592 0.267662
chargesum: 0.00000
title: Mulliken charges with hydrogens summed into heavy atoms:
elementType: S S O O O O O O N N N N C C C C C
charge: 1.025253 1.025253 -0.485491 -0.507034 -0.485493 -0.507034 -0.235477 -0.235475 -0.274542 -0.274543 0.101397 0.101397 0.263498 0.022087 0.022083 0.222060 0.222060
polarizability: 2.43219630e+02 -1.45448024e-03 1.61152216e+02 4.32719252e-01 -7.45741952e-04 1.42431125e+02
1716.lowfreq: -5.0476 -0.0027 0.0016 0.0022 2.7740 3.6321 10.8310 15.0373 30.8474
frequency: 10.6300 14.4085 30.8308 38.5124 48.8601 65.2358 75.5818 84.6896 96.5516 115.5893 117.0620 156.9742 157.1098 183.9043 187.1504 211.6484 212.7200 214.8205 217.0608 241.5892 272.8181 276.7801 290.2511 305.3138 305.4224 351.4773 360.8795 361.1160 383.1500 458.1978 476.0889 534.0606 615.1600 732.9448 733.1448 777.2800 788.3692 790.4354 818.7265 832.5810 840.0026 936.1112 958.9962 1033.5954 1040.6472 1051.4692 1072.5444 1072.5788 1098.5984 1101.4392 1106.6559 1150.8692 1151.1907 1210.3065 1244.6629 1256.9005 1299.2104 1322.6772 1323.3288 1350.5761 1406.5200 1406.5654 1419.7985 1426.5207 1448.0743 1448.0951 1455.5783 1455.8079 1482.2874 2990.6775 2990.7035 3013.4751 3044.9637 3047.7390 3079.0158 3091.2277 3091.2372 3107.4204 3107.4216 3141.5888 3145.0298
redmass: 13.5345 4.7841 8.3272 3.7748 4.7407 5.2701 7.5471 2.0219 8.3031 9.5550 7.9970 1.0869 1.0791 6.8893 8.2628 5.3470 4.3137 5.1210 4.9297 5.6404 5.9855 6.1420 5.5842 5.7544 5.2101 8.6578 7.1923 7.2448 10.6754 18.5592 8.2126 9.3536 5.5109 3.8626 3.8103 1.1190 6.6406 6.6703 1.5677 14.4544 6.2671 3.7211 5.7232 4.8778 1.8407 3.4297 1.4166 1.4059 2.3638 4.4556 1.4938 1.9901 1.9951 1.1865 1.3029 1.2002 1.0978 11.2443 10.2311 1.2925 1.1496 1.1500 1.1136 1.0914 1.0450 1.0451 1.0438 1.0434 1.0869 1.0303 1.0303 1.0592 1.0556 1.0549 1.1060 1.1021 1.1021 1.1022 1.1022 1.1126 1.1115
irintensity: 0.6821 1.5492 0.5776 1.6391 15.0633 1.0538 0.5218 0.5762 1.2460 0.2633 1.1923 0.8833 0.0297 2.0063 43.7609 2.9640 0.8337 7.7269 0.1604 1.8439 43.2060 0.3211 47.3569 20.3711 0.3052 3.5688 3.3315 5.8104 56.2129 52.5320 139.3906 71.8398 0.1962 2.9865 0.5492 3.6265 189.5898 202.7952 10.5399 19.0654 113.1383 92.8961 15.1553 0.7944 50.6386 13.5719 9.1950 20.1190 71.1550 93.3131 29.3952 14.5024 3.7811 4.7288 10.5705 10.1215 0.9288 47.9929 51.2149 42.5757 46.1339 12.3531 0.1102 11.7415 11.5834 27.7839 43.0999 2.9258 13.8592 14.4608 0.9581 0.0159 1.7977 0.0234 0.8104 9.0334 8.0954 0.1689 0.0425 0.6444 3.9608
temp: 298.150 k
press: 1.00000 atm
elementType: 16 16 8 8 8 8 8 8 7 7 7 7 6 6 6 6 6 1 1 1 1 1 1 1 1 1 1 1 1
symmnumber: 1
zpe: 510609.5 jmol-1
zpe.correction: 0.194481 hartree
zpe.thermalcorrener: 0.216856 hartree
zpe.thermalcorrenthalpy: 0.217800 hartree
zpe.thermalcorrgfe: 0.138282 hartree
zpe.sumelectzpe: -1662.348905 hartree
zpe.sumelectthermal: -1662.326530 hartree
zpe.sumelectthermalent: -1662.325586 hartree
zpe.sumelectthermalfe: -1662.405104 hartree
dipole: -0.0002 -2.9397 -0.0004
dipole: 2.9397
quadrupole: -110.8752 -137.2407 -129.7709
quadrupole: 0.0002 17.9747 0.0003
quadrupole: 15.0871 -11.2784 -3.8086 0.0002 17.9747 0.0003
hfenergy: -1662.5433861 hartree
pointgroup: C01 [X(C5H12N4O6S2)]
dipole: -0.0001472 -1.1565801 0.0002685 debye
polarizability: 240.5012191|-0.0009075|161.1522132|16.3334648|-0.0081242|145.1495396 unknown
InChI: InChI=1S/C5H12N4O6S2/c1-8(6-10)16(12,13)4-3-5-17(14,15)9(2)7-11/h3-5H2,1-2H3
charge 0 multiplicity 1
29 atoms
S  -2.720716 0.544351 -0.772581
S  2.720757 0.544511 0.771764
O  -2.862801 1.643513 0.403973
O  -2.766577 0.988628 -2.330956
O  2.863073 1.642935 -0.405453
O  2.766518 0.989748 2.329869
O  -4.965046 -2.469841 0.55807
O  4.964811 -2.470888 -0.556675
N  -4.123688 -0.797686 -0.64283
N  4.123608 -0.797742 0.642965
N  -3.98051 -1.652043 0.435494
N  3.980465 -1.65275 -0.434848
C  0.00002 0.327443 -0.00038
C  -1.170736 -0.579516 -0.396552
C  1.170689 -0.579415 0.396288
C  -5.271196 -0.736665 -1.565659
C  5.271025 -0.736267 1.565877
H  -0.297183 0.97513 0.844606
H  0.297285 0.974646 -0.845714
H  -1.032526 -1.129004 -1.341283
H  -1.540756 -1.230099 0.411636
H  1.03241 -1.12839 1.341307
H  1.540668 -1.230462 -0.411543
H  -5.430842 -1.730455 -2.01922
H  -5.025121 -0.004274 -2.353455
H  -6.187476 -0.43486 -1.028781
H  6.187395 -0.434878 1.02892
H  5.430521 -1.729795 2.020061
H  5.024927 -0.003373 2.353198
