program: Gaussian 09
title: 000234130
version: EM64L-G09RevD.01
frameworkgroup: C1[X(C17H20O2S)]
method: RPBEPBE
basis: SDD
operation: Freq
keyword: #p
keyword: freq=noraman
keyword: PBEPBE/SDD
title: #p freq=noraman PBEPBE/SDD
converged: YES YES NO NO
title: Mulliken charges:
elementType: S O O C C C C C C C C C C C C C C C C C H H H H H H H H H H H H H H H H H H H H
charge: 0.886481 -0.574989 -0.560588 -0.638463 -0.589216 -0.039273 0.463283 0.504630 -0.693876 -0.679521 -0.442870 -0.341859 -0.383013 -0.377777 -0.224872 -0.239603 -0.252224 -0.236575 -0.234900 -0.230364 0.287556 0.293108 0.252908 0.213478 0.270241 0.195377 0.212899 0.207814 0.253438 0.225958 0.240093 0.265870 0.316803 0.256898 0.232405 0.231201 0.235854 0.227963 0.234152 0.231573
chargesum: 0.00000
title: Mulliken charges with hydrogens summed into heavy atoms:
elementType: S O O C C C C C C C C C C C C C C C C C
charge: 0.886481 -0.574989 -0.560588 -0.350907 -0.043200 0.174204 0.463283 0.504630 -0.015359 0.007688 -0.202777 -0.075988 -0.066209 -0.120880 0.007533 -0.008401 -0.016370 -0.008612 -0.000748 0.001208
polarizability: 2.69791112e+02 -1.42496042e+01 2.58261701e+02 1.15863848e+01 8.82142576e+00 1.72606755e+02
1716.lowfreq: -10.5775 -5.1276 0.0004 0.0010 0.0014 4.7454 17.8641 24.7442 31.7836
frequency: 17.2759 24.6497 31.7488 45.2830 51.1522 82.8790 93.6316 104.5865 123.9180 145.3109 161.8967 193.6697 217.7031 223.2055 231.2549 241.2683 246.7592 281.8267 298.7166 349.7694 356.9414 376.2224 398.8262 399.9179 414.4853 476.2745 496.7986 561.0367 570.9546 588.9819 611.2852 615.0770 644.1219 690.7117 704.2751 755.6364 772.9398 784.6176 792.1248 811.1273 836.9066 843.2198 857.4352 864.0470 894.1307 920.6041 924.2520 931.7890 965.3202 972.1595 974.0709 979.3036 987.8465 990.2927 997.3494 1000.4168 1026.8280 1028.5196 1047.2996 1072.0760 1081.7855 1086.0206 1095.1754 1174.4845 1174.7086 1188.9505 1194.1160 1195.7999 1199.7421 1208.1677 1217.5515 1233.3142 1301.7068 1305.7104 1311.6601 1332.3154 1357.6022 1380.2047 1380.7453 1393.0003 1393.8118 1408.3168 1440.2497 1446.5027 1459.8937 1475.9981 1480.4424 1484.4424 1485.3460 1498.7384 1581.3119 1582.9690 1605.4357 1609.2373 2927.0380 2976.8869 2986.0612 3031.3297 3062.3702 3068.5840 3085.6367 3088.6454 3096.0504 3119.0341 3121.8582 3128.9713 3131.3378 3139.0989 3143.3789 3150.8078 3154.4753 3162.1948 3167.2613 3171.6873
redmass: 3.8551 3.9806 4.0306 4.6613 4.0723 4.3902 3.6927 5.2831 3.8065 5.3407 7.2027 8.5968 2.5212 1.4989 3.7203 1.1130 4.3953 5.3202 3.8229 3.4940 1.9836 3.5530 3.7276 2.8510 3.2722 3.7880 7.0443 3.4003 4.9243 3.6381 6.1774 6.4277 5.7102 1.6947 1.8003 2.0233 2.1982 3.3158 6.2406 3.7002 1.7614 1.3491 1.2525 4.1440 3.4093 1.3463 1.2940 1.4359 1.5526 1.8710 1.4258 1.6671 5.1291 3.2794 1.3385 1.3536 2.3034 2.1222 1.2491 1.3790 1.5216 1.4296 1.5567 1.0603 1.0867 2.7281 1.1384 1.5111 1.1437 1.5704 1.3931 1.3883 1.6110 2.0377 1.4742 1.3117 1.7367 1.2039 6.5711 1.1628 4.4846 1.1472 2.3020 2.1019 1.0412 1.0456 2.1634 1.0536 2.3570 1.0544 5.5463 5.8498 5.8492 5.8787 1.0816 1.0366 1.0354 1.0567 1.0872 1.0985 1.1003 1.1003 1.0999 1.0877 1.1086 1.0851 1.0869 1.0884 1.0920 1.0934 1.0960 1.0961 1.1015 1.1001
irintensity: 2.1530 0.8658 0.4948 0.5000 0.4756 1.6415 3.1280 1.3008 1.1962 2.0259 5.7275 20.7809 1.7585 0.5960 2.4628 0.4684 0.7576 0.4424 8.1027 11.0334 2.7055 11.4126 2.1724 1.7835 2.6961 8.4859 47.4106 67.0295 5.4048 12.2445 1.0719 1.6384 1.2899 59.3197 38.3838 18.3160 21.1922 18.3173 72.1563 2.2401 8.6959 1.4775 0.9328 0.6354 67.6134 4.4043 1.8969 0.4689 1.1986 2.1717 0.1508 0.7156 1.0976 0.5160 0.2307 0.1490 1.9934 9.9119 6.3995 14.4075 2.3128 5.9339 12.0879 0.1311 0.7472 3.5094 4.8354 2.6982 2.5979 3.8459 3.6755 2.7132 2.8054 16.7049 68.6915 1.8675 6.8789 31.3405 0.8390 40.7018 2.0101 2.1673 19.6165 15.9700 5.2719 18.1899 3.9433 6.1724 10.3159 23.1923 0.9857 1.4385 2.3167 1.5292 15.7875 43.3667 23.7146 10.0644 5.6371 36.8836 43.9894 13.3450 19.4981 4.6032 4.4703 0.4413 0.2487 5.4313 20.6966 23.1488 11.6399 13.7037 31.4452 20.7938
temp: 298.150 k
press: 1.00000 atm
elementType: 16 8 8 6 6 6 6 6 6 6 6 6 6 6 6 6 6 6 6 6 1 1 1 1 1 1 1 1 1 1 1 1 1 1 1 1 1 1 1 1
symmnumber: 1
zpe: 848038.1 jmol-1
zpe.correction: 0.323001 hartree
zpe.thermalcorrener: 0.343708 hartree
zpe.thermalcorrenthalpy: 0.344652 hartree
zpe.thermalcorrgfe: 0.271196 hartree
zpe.sumelectzpe: -1206.698827 hartree
zpe.sumelectthermal: -1206.678120 hartree
zpe.sumelectthermalent: -1206.677176 hartree
zpe.sumelectthermalfe: -1206.750632 hartree
dipole: -0.1832 4.4588 -2.6087
dipole: 5.1692
quadrupole: -113.1058 -122.0069 -127.8335
quadrupole: -8.0120 4.9813 4.0812
quadrupole: 7.8763 -1.0248 -6.8514 -8.0120 4.9813 4.0812
hfenergy: -1207.0218279 hartree
pointgroup: C01 [X(C17H20O2S1)]
dipole: -0.2743185 1.7642967 -0.9736259 debye
polarizability: 272.0199765|-13.1826708|253.1379858|16.5348013|13.0533964|175.5016052 unknown
InChI: InChI=1S/C13H11.C4H9O2S/c1-3-7-12(8-4-1)11-13-9-5-2-6-10-13;1-4(2)3-7(5)6/h1-11H;4H,3H2,1-2H3
charge 0 multiplicity 1
40 atoms
S  -0.948805 -1.119525 0.287458
O  -0.797028 -2.587846 -0.439555
O  -0.825639 -1.034124 1.922129
C  0.556782 0.174225 -0.627251
C  -2.687006 -0.320435 -0.177728
C  -3.817012 -1.357362 -0.277911
C  0.145991 1.559739 -0.257647
C  1.855003 -0.425102 -0.21436
C  -3.762839 -2.169636 -1.594321
C  -3.905919 -2.2767 0.965219
C  -0.215888 2.470968 -1.288674
C  2.232237 -1.677373 -0.785342
C  0.059715 1.989261 1.098573
C  2.737234 0.197887 0.711846
C  -0.619436 3.78777 -0.980918
C  3.451673 -2.28727 -0.433481
C  -0.355132 3.302974 1.402402
C  3.962557 -0.411723 1.052137
C  -0.688359 4.209188 0.367663
C  4.323172 -1.656693 0.486128
H  0.282222 -0.0982 -1.659914
H  -2.807786 0.392263 0.654126
H  -2.499801 0.209873 -1.127441
H  -4.740071 -0.7335 -0.301939
H  -2.85098 -2.79027 -1.624034
H  -3.767028 -1.504489 -2.479224
H  -4.642644 -2.834223 -1.666853
H  -4.843953 -2.859469 0.935851
H  -3.060973 -2.987793 0.981885
H  -3.882404 -1.698195 1.905984
H  -0.158833 2.149543 -2.336213
H  1.551137 -2.175945 -1.483268
H  0.267767 1.277172 1.903949
H  2.480987 1.170517 1.140905
H  -0.880202 4.48128 -1.787918
H  3.722095 -3.253822 -0.871939
H  -0.426904 3.61805 2.449254
H  4.637495 0.084302 1.758311
H  -1.005216 5.22972 0.609445
H  5.274492 -2.128739 0.755867
