program: Gaussian 09
title: 000234129
version: EM64L-G09RevD.01
frameworkgroup: C1[X(C16H18O2S)]
method: RPBEPBE
basis: SDD
operation: Freq
keyword: #p
keyword: freq=noraman
keyword: PBEPBE/SDD
title: #p freq=noraman PBEPBE/SDD
converged: NO YES NO NO
title: Mulliken charges:
elementType: S O O C C C C C C C C C C C C C C C C H H H H H H H H H H H H H H H H H H
charge: 0.883517 -0.572682 -0.574172 -0.633436 -0.252145 0.454348 0.507149 -0.655503 -0.665853 -0.441829 -0.342924 -0.381626 -0.375787 -0.224759 -0.238609 -0.250645 -0.236476 -0.235927 -0.230675 0.282353 0.275238 0.217961 0.240560 0.269699 0.224421 0.267714 0.221194 0.236777 0.265504 0.318274 0.256278 0.232158 0.230902 0.235653 0.227844 0.234200 0.231303
chargesum: 0.00000
title: Mulliken charges with hydrogens summed into heavy atoms:
elementType: S O O C C C C C C C C C C C C C C C C
charge: 0.883517 -0.572682 -0.574172 -0.351083 0.023093 0.454348 0.507149 0.072717 0.047476 -0.205052 -0.077420 -0.063352 -0.119509 0.007399 -0.007706 -0.014992 -0.008631 -0.001728 0.000628
polarizability: 2.71954385e+02 -6.09733094e+00 2.26207658e+02 4.95873092e+00 1.48417537e+01 1.64431873e+02
1716.lowfreq: -7.0798 -0.0014 0.0013 0.0014 5.1527 6.4623 25.6298 32.4469 38.3571
frequency: 25.5549 32.3727 38.0492 45.7394 58.7585 84.4303 107.6604 110.0052 153.0813 169.0788 177.1289 193.8395 216.8242 231.7910 239.7254 246.3959 281.2127 291.5402 348.0472 374.1992 399.0378 401.8452 412.6967 468.0932 476.5660 490.4872 566.0966 575.5723 611.2969 615.0215 645.0391 690.5999 704.7109 755.1705 773.3430 793.9259 810.3725 841.6533 857.6059 863.8163 870.4931 892.2129 921.3025 932.9381 937.0943 945.8553 974.0040 979.6110 988.2280 990.7931 997.3448 1001.7426 1026.9677 1028.7629 1034.9993 1071.5647 1084.5148 1096.3283 1139.7072 1164.7016 1174.6214 1174.9370 1188.4501 1194.6896 1200.7664 1218.7884 1220.4898 1303.5814 1316.1363 1333.2790 1356.1684 1380.5383 1382.0552 1393.2000 1395.0884 1440.3877 1445.9738 1452.7724 1466.3171 1470.2222 1480.7514 1484.9138 1487.3430 1581.7355 1584.1267 1605.5467 1609.2875 2980.0518 2983.3032 3059.0961 3068.0873 3072.1865 3078.5182 3092.6826 3102.6407 3118.0301 3128.5750 3131.3025 3139.0049 3143.6032 3150.8185 3155.1246 3162.1646 3167.3815 3171.7540
redmass: 4.0753 3.8162 3.2504 4.6130 4.3771 4.4539 5.2016 5.5804 6.4444 1.9337 4.1181 1.5687 2.9233 3.8033 1.6215 4.2037 5.2021 4.5211 3.2575 4.0780 2.8646 3.5963 3.2660 3.2802 4.0992 6.1263 3.4436 6.0733 6.1783 6.4686 5.7062 1.6961 1.8312 2.0075 2.0888 9.2013 3.6969 1.2737 1.2561 4.2162 2.6700 6.7565 1.4546 1.4311 1.1582 1.3495 1.4332 1.7147 4.7793 3.1456 1.3390 1.3600 2.2723 2.1265 1.3205 1.3490 1.5127 1.5491 2.3194 1.8468 1.0604 1.0871 2.8987 1.1183 1.1253 1.3397 1.3468 2.1429 1.5040 1.3110 1.6585 6.6723 1.2194 4.6366 1.2053 2.2924 2.0812 1.0478 1.0517 1.0467 2.1555 2.3627 1.0521 5.5854 5.8067 5.8501 5.8614 1.0358 1.0363 1.0883 1.0869 1.0978 1.0974 1.1000 1.0999 1.0878 1.0851 1.0869 1.0885 1.0921 1.0934 1.0960 1.0962 1.1014 1.0997
irintensity: 2.1828 0.5197 1.3528 0.6048 1.2531 1.8130 2.5069 1.5955 7.1522 2.3062 3.0230 0.6220 21.7092 9.2803 1.4025 1.0318 0.3037 6.3510 5.3467 16.3950 0.5329 1.9757 2.0819 3.6650 16.0167 24.4526 51.5880 9.0417 1.1548 1.7167 1.3362 58.9483 38.8032 18.6049 25.0992 74.8057 2.6335 2.0815 1.1797 0.0961 1.5450 57.9844 4.8546 0.7104 5.3292 1.1176 0.2166 0.4948 0.8836 1.0110 0.2227 0.4141 5.0004 9.6624 75.8228 11.0548 2.8424 13.2808 0.5954 43.5388 0.1523 0.7738 2.9873 4.7220 3.0613 13.4963 23.1787 24.1450 0.7260 1.9203 5.6115 1.6787 37.8220 0.8681 23.9118 19.2145 13.4401 10.6572 17.3186 3.9366 3.6707 11.7363 16.0620 1.3822 1.2066 1.9829 1.2633 13.7021 35.3276 0.9188 6.4325 13.3144 10.0184 11.9702 14.0973 5.7314 0.2931 0.3239 6.1459 21.3340 23.3019 11.6733 14.2126 30.3070 19.6772
temp: 298.150 k
press: 1.00000 atm
elementType: 16 8 8 6 6 6 6 6 6 6 6 6 6 6 6 6 6 6 6 1 1 1 1 1 1 1 1 1 1 1 1 1 1 1 1 1 1
symmnumber: 1
zpe: 774606.2 jmol-1
zpe.correction: 0.295032 hartree
zpe.thermalcorrener: 0.314568 hartree
zpe.thermalcorrenthalpy: 0.315512 hartree
zpe.thermalcorrgfe: 0.245380 hartree
zpe.sumelectzpe: -1167.481947 hartree
zpe.sumelectthermal: -1167.462411 hartree
zpe.sumelectthermalent: -1167.461467 hartree
zpe.sumelectthermalfe: -1167.531599 hartree
dipole: -2.8755 3.6014 -2.8358
dipole: 5.4111
quadrupole: -100.6132 -123.0221 -120.7334
quadrupole: 1.9896 2.4187 7.6746
quadrupole: 14.1764 -8.2325 -5.9439 1.9896 2.4187 7.6746
hfenergy: -1167.776979 hartree
pointgroup: C01 [X(C16H18O2S1)]
dipole: 1.2808129 1.5025185 0.7963335 debye
polarizability: 272.7881184|1.6844966|216.6551539|1.0658794|-26.3544613|173.1506438 unknown
InChI: InChI=1S/C13H11.C3H7O2S/c1-3-7-12(8-4-1)11-13-9-5-2-6-10-13;1-3(2)6(4)5/h1-11H;3H,1-2H3
charge 0 multiplicity 1
37 atoms
S  0.33188 -1.795398 -0.005735
O  0.192201 -1.846265 -1.640508
O  -0.498582 -2.888325 0.900473
C  -0.241397 0.173527 0.703733
C  2.278619 -2.05045 0.421647
C  0.778985 1.109332 0.144319
C  -1.693145 0.274729 0.379777
C  2.726296 -3.244636 -0.420543
C  2.383314 -2.222344 1.93439
C  1.602431 1.845328 1.041382
C  -2.608956 -0.519575 1.131744
C  0.983191 1.263456 -1.257666
C  -2.202374 1.132205 -0.63419
C  2.580841 2.739515 0.556515
C  -3.991385 -0.459228 0.870149
C  1.970232 2.15023 -1.737781
C  -3.588817 1.197139 -0.884776
C  2.766548 2.896493 -0.836985
C  -4.48777 0.400132 -0.138699
H  -0.072393 -0.057657 1.768221
H  2.699146 -1.099117 0.053472
H  3.824755 -3.352928 -0.33862
H  2.257063 -4.179839 -0.067423
H  2.46722 -3.100355 -1.483507
H  3.426991 -2.477147 2.199732
H  1.727895 -3.043532 2.275336
H  2.111819 -1.302627 2.482314
H  1.458062 1.730598 2.123013
H  -2.225206 -1.200044 1.899276
H  0.404899 0.651698 -1.957778
H  -1.520636 1.768682 -1.205187
H  3.196075 3.309721 1.26117
H  -4.681309 -1.083531 1.447995
H  2.124441 2.252482 -2.817628
H  -3.968905 1.86952 -1.661738
H  3.5281 3.586835 -1.216201
H  -5.563931 0.450174 -0.338795
