program: Gaussian 09
title: 000234119
version: EM64L-G09RevD.01
frameworkgroup: C1[X(C23H24N4)]
method: RPBEPBE
basis: SDD
operation: Freq
keyword: #pfreq=noraman
keyword: PBEPBE/SDD
title: #p freq=noraman PBEPBE/SDD
converged: YES YES NO NO
title: Mulliken charges:
elementType: N N N N C C C C C C C C C C C C C C C C C C C C C C C H H H H H H H H H H H H H H H H H H H H H H H H
charge: -0.191286 -0.191151 -0.036068 -0.039425 -0.710537 0.452171 0.446889 -0.222459 -0.204885 0.241409 0.239690 0.278393 0.280093 -0.415553 -0.422020 -0.384752 -0.384740 -0.308429 -0.307093 -0.209117 -0.208528 -0.652624 -0.658499 -0.657939 -0.652582 -0.389581 -0.390928 0.240174 0.242813 0.269873 0.265940 0.235694 0.236079 0.271381 0.272074 0.225520 0.225702 0.246269 0.200983 0.225734 0.261100 0.223558 0.214793 0.261243 0.214889 0.223472 0.246271 0.225530 0.201226 0.234618 0.234614
chargesum: 0.00000
title: Mulliken charges with hydrogens summed into heavy atoms:
elementType: N N N N C C C C C C C C C C C C C C C C C C C C C C C
charge: -0.191286 -0.191151 -0.036068 -0.039425 -0.227549 0.452171 0.446889 -0.222459 -0.204885 0.241409 0.239690 0.278393 0.280093 -0.145679 -0.156080 -0.149058 -0.148661 -0.037049 -0.035019 0.016404 0.017175 0.020362 0.040951 0.041665 0.020445 -0.154963 -0.156314
polarizability: 3.56121899e+02 -1.12275212e+01 3.36177441e+02 1.42516385e-01 1.14405496e+00 1.96729075e+02
1716.lowfreq: -0.0002 0.0007 0.0007 2.2326 3.6639 7.1115 16.2870 23.9887 31.9904
frequency: 16.0008 23.9179 31.9223 67.1071 76.9091 80.8061 95.8640 119.9206 129.6058 136.6886 144.3715 156.7558 177.8029 179.9371 222.6076 231.5542 239.5448 254.8639 265.0659 273.9794 303.8816 319.9987 338.4485 347.4900 364.2626 378.6534 394.4657 441.8456 446.0638 465.0157 467.5268 474.7883 482.4340 496.2916 506.6074 524.3318 541.3132 564.1430 567.5980 609.3330 636.1014 664.0081 665.3867 669.9366 671.8634 722.1710 726.0168 793.5655 807.4314 810.4224 811.6391 820.8381 828.0478 845.3486 858.2664 900.2961 903.0933 913.9646 938.6297 939.8098 962.5614 968.5678 986.7142 988.2887 1002.0391 1011.5780 1014.8518 1045.4560 1048.5015 1053.1111 1054.2177 1065.0536 1090.5906 1092.0584 1132.1850 1132.6666 1139.7674 1141.8791 1148.9293 1156.8514 1186.6909 1198.2278 1198.8432 1209.6414 1210.7073 1228.9560 1234.4930 1255.2486 1261.0247 1310.2304 1319.0779 1324.2409 1339.8170 1343.0651 1371.1785 1372.0388 1391.6963 1392.8780 1400.6397 1406.6143 1426.7951 1427.5261 1441.6508 1442.6796 1457.8544 1462.3941 1464.1294 1465.7167 1469.5702 1476.2741 1477.8528 1481.5048 1482.2152 1494.7712 1495.7715 1504.3704 1504.8567 1571.3874 1574.0746 1583.7114 1585.8470 1593.6712 1595.8804 2892.4387 2892.5282 2909.2922 2909.8922 3018.3543 3018.5210 3024.4940 3024.9044 3029.1497 3090.4378 3090.9143 3091.0620 3111.3165 3111.7457 3112.4765 3112.5524 3132.1382 3132.8030 3143.3342 3144.0941 3154.0771 3155.4938 3166.1574 3166.7333
redmass: 4.6742 4.6458 4.5673 3.3362 2.9346 3.1939 3.5988 3.0322 2.6989 4.0586 2.2663 2.8848 4.0356 3.9545 1.4977 1.5421 3.3449 2.5106 1.3292 1.3787 2.4382 3.2644 3.0252 3.3132 2.6680 3.9908 3.5881 4.0083 3.9401 3.5672 3.6048 3.6380 4.3595 5.5794 5.3159 3.8725 5.2159 4.9231 4.8053 3.4492 4.3143 6.3897 6.4843 4.0092 4.1814 4.1739 3.8423 2.2013 2.3619 5.1420 2.0867 2.4808 4.5193 1.4035 1.6986 4.0119 3.1747 2.3389 1.4123 1.4225 1.3618 1.4106 1.3418 1.3394 3.4177 3.2524 3.7804 2.5273 1.8954 1.6650 1.6551 2.2810 1.2327 1.2380 1.4150 1.4136 1.4244 1.4206 1.9074 1.8515 1.2220 2.8808 2.9230 1.8031 1.7737 2.0210 1.9643 2.4746 2.1959 1.4045 3.4204 2.7485 3.2798 3.0814 2.8037 3.0453 2.5149 2.4312 2.9613 2.4523 1.1369 1.1370 1.3828 1.3382 1.2095 1.9840 1.0491 1.0497 1.5089 1.1731 1.2011 1.0544 1.0722 1.7836 1.9282 1.6898 1.5933 6.1554 6.1251 6.1528 6.1812 6.8746 6.5249 1.0535 1.0535 1.0520 1.0519 1.0846 1.0848 1.0782 1.0782 1.0582 1.1000 1.1029 1.1000 1.0892 1.0893 1.0961 1.0961 1.0886 1.0886 1.0888 1.0888 1.0946 1.0944 1.0993 1.0991
irintensity: 0.3074 0.8116 1.4521 3.1461 4.8018 1.6567 0.5887 2.7351 5.2208 1.6864 3.2749 1.2501 6.9568 7.3019 0.8049 0.9223 0.1496 0.1600 0.3578 0.2878 3.8491 1.4671 8.9043 9.2047 4.7761 0.5406 2.1039 1.0577 0.2102 6.3286 1.0454 11.4383 0.3537 12.4388 8.3656 1.4400 1.7778 3.4184 15.1075 0.7168 1.1582 0.3478 0.0483 4.1459 2.4061 2.5297 0.1970 22.5099 44.9061 5.5347 64.8595 15.7063 1.6492 32.4815 25.6842 3.9416 7.6938 11.9935 0.8724 0.5782 6.2398 4.4288 3.0843 1.9734 9.8656 80.2740 16.4776 39.3695 12.9111 30.1403 16.6255 16.9780 7.9526 9.2777 56.9313 19.1764 3.0545 9.8675 8.0586 7.7622 1.0821 6.2078 19.4303 27.3314 11.3439 2.1901 1.5198 0.5298 2.4852 3.1998 32.4390 13.4737 22.2151 2.5140 108.1338 2.6085 35.7995 28.1976 39.3256 8.4101 6.3683 6.2194 45.1258 20.4244 31.6114 152.8697 21.0928 14.5342 16.6345 24.2073 4.8084 12.4629 12.4372 15.7754 5.7052 17.5798 17.5887 7.3996 0.0886 148.6884 56.0431 32.5160 4.0898 183.7092 18.7254 224.1718 120.9606 54.9798 42.5752 43.4142 45.3830 17.8548 23.7539 8.8707 19.6713 25.0479 20.3408 25.6697 21.8724 6.3555 7.2827 8.2295 9.0921 17.7664 16.8655 38.6514 24.6698
temp: 298.150 k
press: 1.00000 atm
elementType: 7 7 7 7 6 6 6 6 6 6 6 6 6 6 6 6 6 6 6 6 6 6 6 6 6 6 6 1 1 1 1 1 1 1 1 1 1 1 1 1 1 1 1 1 1 1 1 1 1 1 1
symmnumber: 1
zpe: 1095738.4 jmol-1
zpe.correction: 0.417345 hartree
zpe.thermalcorrener: 0.441456 hartree
zpe.thermalcorrenthalpy: 0.442401 hartree
zpe.thermalcorrgfe: 0.363001 hartree
zpe.sumelectzpe: -1107.922713 hartree
zpe.sumelectthermal: -1107.898601 hartree
zpe.sumelectthermalent: -1107.897657 hartree
zpe.sumelectthermalfe: -1107.977056 hartree
dipole: -0.3936 -0.0755 3.9370
dipole: 3.9573
quadrupole: -123.3245 -141.6613 -161.3027
quadrupole: 3.2931 3.0302 -0.3402
quadrupole: 18.7717 0.4348 -19.2065 3.2931 3.0302 -0.3402
hfenergy: -1108.3400575 hartree
pointgroup: C01 [X(C23H24N4)]
dipole: 0.1434105 0.1530048 -1.5427376 debye
polarizability: 356.2248855|11.1639761|334.4080843|0.2961785|15.1665374|198.3954446 unknown
InChI: InChI=1S/C23H24N4/c1-26(2)20-11-9-16(22-18(20)7-5-13-24-22)15-17-10-12-21(27(3)4)19-8-6-14-25-23(17)19/h5-14H,15H2,1-4H3
charge 0 multiplicity 1
51 atoms
N  4.692944 -0.883739 -1.486189
N  -4.766804 1.179588 -1.08727
N  1.826064 1.882004 1.487373
N  -1.877419 -2.276709 1.010998
C  0.001399 -0.304311 1.975656
C  1.21288 -0.43316 1.056726
C  -1.269327 0.071103 1.218625
C  2.104645 0.679127 0.841297
C  -2.173398 -0.942762 0.735074
C  3.241408 0.544965 -0.055646
C  -3.380511 -0.566428 0.017525
C  3.53199 -0.737427 -0.666968
C  -3.624712 0.825883 -0.306007
C  1.475665 -1.626103 0.37054
C  -1.594693 1.410857 0.970154
C  2.617825 -1.787332 -0.464613
C  -2.740019 1.788607 0.212049
C  3.990332 1.729104 -0.349904
C  -4.319404 -1.604918 -0.281182
C  3.677669 2.933434 0.285081
C  -4.0203 -2.932878 0.032434
C  4.691782 -1.961011 -2.488128
C  6.019909 -0.700211 -0.852966
C  -4.844159 0.668883 -2.476251
C  -5.281797 2.552281 -0.963608
C  2.602105 2.949606 1.226002
C  -2.76515 -3.221785 0.651536
H  -0.163772 -1.268593 2.4841
H  0.211042 0.475637 2.726075
H  0.782778 -2.463904 0.508978
H  -0.912317 2.185411 1.338375
H  2.79562 -2.762881 -0.928431
H  -2.907349 2.850709 0.007022
H  4.778853 1.682621 -1.10737
H  -5.286442 -1.33498 -0.717092
H  4.226278 3.854424 0.064091
H  -4.73019 -3.740984 -0.169959
H  3.731659 -1.971638 -3.03037
H  4.863024 -2.97387 -2.051691
H  5.500119 -1.771606 -3.218051
H  5.964736 0.04229 -0.043177
H  6.757019 -0.351922 -1.600978
H  6.396287 -1.652641 -0.413232
H  -4.366401 -0.318939 -2.55378
H  -4.327652 1.35111 -3.190345
H  -5.900451 0.575683 -2.791866
H  -5.343497 2.838956 0.099511
H  -6.299794 2.592047 -1.392362
H  -4.661134 3.309845 -1.498893
H  2.3563 3.871902 1.767622
H  -2.488945 -4.258646 0.881786
