program: Gaussian 09
title: 000234113
version: EM64L-G09RevD.01
frameworkgroup: C1[X(C14H10Cl2)]
method: RPBEPBE
basis: SDD
operation: Freq
keyword: #p
keyword: freq=noraman
keyword: PBEPBE/SDD
title: #p freq=noraman PBEPBE/SDD
converged: YES YES NO NO
title: Mulliken charges:
elementType: Cl Cl C C C C C C C C C C C C C C H H H H H H H H H H
charge: -0.071557 -0.071557 0.586843 0.586840 -0.287351 -0.287346 -0.319551 -0.319550 -0.384010 -0.384011 -0.239612 -0.239614 -0.247617 -0.247615 -0.230304 -0.230304 0.232307 0.232305 0.233040 0.233041 0.257044 0.257044 0.233374 0.233374 0.237392 0.237392
chargesum: 0.00000
title: Mulliken charges with hydrogens summed into heavy atoms:
elementType: Cl Cl C C C C C C C C C C C C C C
charge: -0.071557 -0.071557 0.586843 0.586840 -0.055044 -0.055041 -0.319551 -0.319550 -0.150969 -0.150969 0.017432 0.017430 -0.014243 -0.014241 0.007088 0.007088
polarizability: 3.28887963e+02 2.74154528e+01 2.00048990e+02 -1.65367066e-03 4.72264095e-04 6.24898144e+01
1716.lowfreq: -2.6218 0.0018 0.0022 0.0024 5.9019 6.5703 12.0379 56.0664 61.8672
frequency: 12.0379 56.0664 61.8672 77.8815 140.4850 144.3010 157.8171 198.1218 241.1756 281.6586 300.4693 367.8010 387.6620 398.8554 432.6041 452.8511 508.9296 510.8005 550.6906 556.4672 618.3533 659.9911 691.6929 707.7523 733.2220 756.7213 765.8809 827.5539 860.7982 864.0905 864.3552 897.0067 947.2899 948.5840 981.8484 985.6877 1000.5277 1011.0272 1013.1800 1040.6332 1042.6614 1120.8363 1121.1747 1171.6325 1172.9724 1200.4283 1239.0656 1286.4764 1288.4741 1302.6989 1328.3030 1369.9296 1386.8682 1427.4594 1430.0592 1450.8927 1472.3613 1562.0116 1566.0967 1595.1672 1604.9934 1639.3514 3126.4231 3135.9487 3137.3982 3139.5617 3150.4961 3150.6604 3163.7631 3163.8755 3177.4095 3177.5386
redmass: 8.3186 4.6623 7.1736 2.9098 3.1704 23.3669 5.2410 6.1163 3.3274 7.9102 4.2632 11.4336 6.8466 9.4857 2.8926 3.3487 3.6600 4.7968 3.5198 7.3704 6.2292 6.9076 7.0110 3.5473 2.4047 1.2215 1.5241 5.4797 1.3429 1.4755 4.0193 2.2344 1.3766 1.3944 1.3024 1.3447 1.1472 6.8619 7.0386 2.1370 2.0342 1.7345 1.8972 1.0687 1.1088 1.7518 1.4242 2.5772 1.7590 1.4215 1.3533 5.4151 3.9697 2.4831 2.2491 2.3407 2.7708 5.8427 5.4386 6.3724 6.9261 5.3043 1.0927 1.0855 1.0853 1.0847 1.0898 1.0897 1.0953 1.0954 1.0998 1.0998
irintensity: 1.1573 1.0092 1.3870 0.0000 0.0000 0.0000 0.3461 0.0000 0.0000 0.4536 0.9087 10.5892 0.0000 0.0000 0.0000 19.3353 0.0018 2.9180 3.6551 29.0102 0.0000 35.0444 0.0001 0.0000 36.7394 0.0002 136.8885 4.1300 0.0000 0.0864 0.0022 0.0000 0.4348 0.0000 13.1291 0.0000 46.3579 100.4160 0.0001 0.0000 10.4112 7.9320 0.0000 3.3809 0.0000 0.0000 13.4837 10.8223 0.0000 27.8980 0.0000 0.0000 2.9352 0.0001 45.8631 0.0000 60.4563 0.0000 11.8451 0.0000 8.8745 0.0000 0.0000 24.7222 0.0002 17.4892 0.0036 6.2578 0.0267 30.9170 35.7308 0.0083
temp: 298.150 k
press: 1.00000 atm
elementType: 17 17 6 6 6 6 6 6 6 6 6 6 6 6 6 6 1 1 1 1 1 1 1 1 1 1
symmnumber: 1
zpe: 504332.0 jmol-1
zpe.correction: 0.192090 hartree
zpe.thermalcorrener: 0.206095 hartree
zpe.thermalcorrenthalpy: 0.207039 hartree
zpe.thermalcorrgfe: 0.148485 hartree
zpe.sumelectzpe: -1458.499316 hartree
zpe.sumelectthermal: -1458.485312 hartree
zpe.sumelectthermalent: -1458.484368 hartree
zpe.sumelectthermalfe: -1458.542922 hartree
dipole: 0.0000 0.0000 0.0035
dipole: 0.0035
quadrupole: -88.1245 -99.9442 -114.0548
quadrupole: 13.0894 -0.0005 0.0004
quadrupole: 12.5833 0.7637 -13.3470 13.0894 -0.0005 0.0004
hfenergy: -1458.6914063 hartree
pointgroup: C01 [X(C14H10Cl2)]
dipole: 0.000009 -0.0013903 0. debye
dipolederiv: -0.1195892 -0.0005742 -0.1863321 -0.0000747 -0.0739277 -0.0020155 -0.0146125 -0.0019129 -0.7373755 -0.119593 -0.0002096 -0.1863399 -0.0000507 -0.0739231 -0.0007971 -0.0146232 -0.0006398 -0.7373741 0.3611128 -0.0000502 -0.1117925 0.0002261 0.0706839 -0.0010698 -0.0066868 -0.0009858 -0.2929211 0.3611199 0.0000503 -0.1117952 0.0001187 0.0706857 -0.0004756 -0.0066901 -0.0004054 -0.2929222 0.0182993 0.0000683 -0.0026785 0.0005309 -0.1465059 0.0003897 0.2687753 0.0005643 0.0512163 0.0182885 0.000163 -0.002679 0.0007409 -0.1465054 0.0003383 0.2687781 0.0005737 0.0512133 -0.0113837 0.0010002 0.3323255 0.0000498 -0.0957045 0.0035419 -0.037075 0.0032965 1.0638545 -0.011385 0.0004119 0.3323369 -0.0000322 -0.095713 0.0013879 -0.0370601 0.0010784 1.063854 -0.1373924 0.0000188 0.0435027 -0.0003048 -0.1341689 0.0004646 -0.068553 0.0004594 0.0256321 -0.1373932 0.0001587 0.0435036 0.0000722 -0.134171 0.0001987 -0.0685503 0.000031 0.0256348 -0.0269572 -0.0004037 -0.153641 -0.000513 -0.0939964 -0.0003861 -0.181985 -0.0004382 -0.1976631 -0.0269582 -0.0000792 -0.1536423 -0.0000646 -0.0939953 -0.0002513 -0.1819846 -0.0002406 -0.1976601 -0.0858647 0.0002216 0.0601721 0.0006272 -0.1520848 0.0007319 0.1682731 0.0008222 0.0879843 -0.085864 0.0001078 0.0601735 0.0001003 -0.1520871 0.0002567 0.1682746 0.0003297 0.087985 -0.0624578 0.0000134 -0.0024776 -0.0000317 -0.1631072 0.0005802 -0.0290028 0.0005421 0.0402136 -0.062458 0.0001456 -0.0024781 0.0000868 -0.1631086 0.0001854 -0.0290046 0.0001834 0.0402143 0.0705028 -0.0001405 -0.0455448 -0.0003216 0.1521977 -0.0003773 -0.1357521 -0.0004134 -0.0118863 0.0705049 -0.0001512 -0.0455455 -0.0003026 0.1521977 -0.0003029 -0.1357546 -0.0004011 -0.0118839 0.0353034 0.0002332 0.0930624 0.0001547 0.1429664 -0.0003701 0.0768331 -0.0004248 -0.0200039 0.0353045 -0.0000547 0.0930615 -0.0000267 0.1429682 -0.0000955 0.0768322 -0.000067 -0.0200068 0.0292656 0.0000868 0.0616004 0.0001843 0.1657514 -0.000437 0.0950736 -0.0004 0.0032859 0.0292674 -0.0000652 0.0615998 -0.0000391 0.1657526 -0.0000872 0.0950736 -0.0000667 0.0032834 0.0427171 -0.0002444 -0.0539819 -0.0003696 0.1630325 -0.0007543 -0.1022408 -0.0007854 -0.0842397 0.0427156 -0.0001441 -0.0539837 -0.0002027 0.1630348 -0.0002543 -0.1022424 -0.0002973 -0.0842403 -0.1135529 -0.0002782 -0.034214 -0.0002754 0.1648637 -0.0002778 -0.0330484 -0.0002896 0.0719025 -0.1135527 -0.0002845 -0.0342125 -0.0002823 0.1648645 -0.0001237 -0.0330473 -0.0001127 0.0719027 unknown
polarizability: 334.1988871|0.1949012|62.490426|-6.2553901|0.2451539|194.7374546 unknown
InChI: InChI=1S/C14H10Cl2/c15-13-7-3-1-5-11(13)9-10-12-6-2-4-8-14(12)16/h1-10H
charge 0 multiplicity 1
26 atoms
Cl -2.333013 0.319394 3.020022
Cl 2.332616 0.311433 -3.017175
C  -1.940652 0.311626 0.210517
C  1.940289 0.313731 -0.20766
C  -0.495251 0.3132 0.475278
C  0.494886 0.31216 -0.472419
C  -2.893354 0.313998 1.270701
C  2.892979 0.31357 -1.267854
C  -2.485983 0.307572 -1.111619
C  2.485634 0.315462 1.114476
C  -4.283996 0.312561 1.05925
C  4.283624 0.315086 -1.056417
C  -3.871533 0.306014 -1.348791
C  3.871187 0.316948 1.351636
C  -4.780031 0.308496 -0.262678
C  4.779674 0.316776 0.265511
H  -0.22382 0.315537 1.537132
H  0.223455 0.310132 -1.534274
H  -1.800037 0.305539 -1.964682
H  1.799701 0.315553 1.96755
H  -4.965514 0.314599 1.914485
H  4.965132 0.314949 -1.911662
H  -4.246848 0.302819 -2.377471
H  4.246512 0.318187 2.380316
H  -5.860807 0.307315 -0.437154
H  5.860451 0.31794 0.439978
