program: Gaussian 09
title: 000234111
version: EM64L-G09RevD.01
frameworkgroup: C1[X(C12H9Cl2N)]
method: RPBEPBE
basis: SDD
operation: Freq
keyword: #p
keyword: freq=noraman
keyword: PBEPBE/SDD
title: #p freq=noraman PBEPBE/SDD
converged: YES YES NO NO
title: Mulliken charges:
elementType: Cl Cl N C C C C C C C C C C C C H H H H H H H H H
charge: -0.063453 -0.063551 -0.518733 0.475659 0.475512 -0.434214 -0.434351 -0.372949 -0.372630 -0.183723 -0.183753 -0.201080 -0.201284 -0.125089 -0.124982 0.300698 0.233355 0.233316 0.271774 0.271731 0.254611 0.254598 0.254286 0.254253
chargesum: 0.00000
title: Mulliken charges with hydrogens summed into heavy atoms:
elementType: Cl Cl N C C C C C C C C C C C C
charge: -0.063453 -0.063551 -0.218036 0.475659 0.475512 -0.200859 -0.201035 -0.101175 -0.100899 0.070888 0.070845 0.053206 0.052969 -0.125089 -0.124982
polarizability: 2.99103784e+02 -5.96816375e-02 1.39720985e+02 -8.66831904e+00 -8.50681833e-02 6.99145996e+01
1716.lowfreq: -0.0035 -0.0029 -0.0011 4.1167 4.3238 15.5034 33.3187 40.8277 67.8982
frequency: 33.2816 40.8141 67.8968 126.5784 130.2980 211.6460 214.9123 278.0959 304.8231 318.5168 353.0439 389.2905 410.3938 416.3905 469.4080 477.6593 495.5977 516.9001 617.7022 619.0730 654.9711 670.1265 694.5883 707.5153 791.2579 805.9775 815.7357 821.5179 838.6865 866.2861 933.0317 937.7352 947.5047 968.9368 989.7597 991.2638 1075.2590 1077.1921 1109.2852 1122.1224 1182.7433 1190.7256 1226.4142 1268.0715 1300.1806 1306.9967 1351.8675 1376.0784 1403.9611 1418.0712 1480.3201 1482.0867 1506.8291 1584.6097 1595.5046 1606.1365 1614.1813 3127.2422 3127.7026 3155.2604 3158.4407 3171.0307 3171.5062 3175.5852 3180.1059 3544.2735
redmass: 5.9710 7.2947 5.2301 7.5917 6.8833 8.2731 11.8410 6.8829 4.7874 6.1077 4.6795 5.6632 2.9775 3.0814 5.9827 1.5854 3.2370 2.0879 6.5792 6.9988 7.2830 5.6304 3.5184 4.1319 2.8190 1.2659 1.6127 1.6506 1.5329 4.6986 1.3278 1.3415 1.3563 1.2961 4.0022 4.1468 2.6248 2.7597 1.3638 1.3097 1.1093 1.1148 3.3654 1.4238 1.2999 1.7693 3.4131 7.4715 4.7755 3.3027 2.0318 2.5456 2.6224 8.0740 3.8668 6.4261 6.3988 1.0898 1.0900 1.0883 1.0888 1.0952 1.0952 1.0972 1.0963 1.0755
irintensity: 0.7079 0.2910 0.2107 0.3815 3.6096 0.9434 0.2350 0.0461 6.0933 0.0069 23.9336 10.0258 0.8645 0.5320 1.1986 201.0052 11.6153 7.1656 0.1125 6.5971 38.5460 1.3704 6.0166 0.0383 10.0610 0.6255 158.5552 0.6940 9.3916 3.6132 0.1171 0.1570 0.7990 0.1623 37.5747 4.3880 76.7252 9.6555 5.4170 16.5473 19.2760 4.1714 6.4473 6.6744 0.0004 31.6445 146.4798 3.6987 0.1676 1.0646 263.0297 25.4015 532.7132 0.9294 18.5647 213.0194 0.4990 10.5153 14.9819 11.7391 1.3485 7.3782 6.2249 1.2195 1.1757 20.6018
temp: 298.150 k
press: 1.00000 atm
elementType: 17 17 7 6 6 6 6 6 6 6 6 6 6 6 6 1 1 1 1 1 1 1 1 1
symmnumber: 1
zpe: 460664.0 jmol-1
zpe.correction: 0.175458 hartree
zpe.thermalcorrener: 0.188435 hartree
zpe.thermalcorrenthalpy: 0.189379 hartree
zpe.thermalcorrgfe: 0.134115 hartree
zpe.sumelectzpe: -1436.506685 hartree
zpe.sumelectthermal: -1436.493708 hartree
zpe.sumelectthermalent: -1436.492763 hartree
zpe.sumelectthermalfe: -1436.548028 hartree
dipole: 0.0046 2.6313 0.0009
dipole: 2.6313
quadrupole: -125.2558 -87.3072 -104.5394
quadrupole: -0.0207 -2.7579 -0.0403
quadrupole: -19.5550 18.3936 1.1614 -0.0207 -2.7579 -0.0403
hfenergy: -1436.6821428 hartree
pointgroup: C01 [X(C12H9Cl2N1)]
dipole: 0.00345 1.0344758 0.0392597 debye
dipolederiv: -0.9060751 -0.2317957 -0.0069944 -0.3231014 -0.2145777 -0.029069 0.0019302 -0.0219264 -0.0793579 -0.9006581 0.2385127 0.0094557 0.3285993 -0.2234986 0.0186967 0.0244571 0.0114783 -0.0760936 -2.3936601 0.0119381 -0.0080354 0.0095615 -0.2380665 0.0059417 0.0723698 0.0060738 -0.3669103 1.8005836 0.2746547 0.0298861 0.9333607 0.0775885 0.0164305 -0.1502462 0.0059254 0.1071697 1.7894234 -0.2947489 0.0090874 -0.9377646 0.0925154 -0.0188938 -0.2225215 -0.0065183 0.1054396 -0.4924995 -0.0995771 -0.0570604 0.1555499 0.0337656 0.09753 0.0321558 0.1059489 -0.1628247 -0.4933971 0.1103175 -0.0494413 -0.1513596 0.0493778 -0.0802575 0.0189256 -0.0887962 -0.1783874 -0.2605129 0.0296819 -0.0154633 -0.4875309 -0.0831425 0.0686838 -0.0955756 0.0688061 -0.1294889 -0.2558126 -0.0264565 -0.0181769 0.4962399 -0.0777845 -0.0636509 -0.0575571 -0.0639053 -0.1402846 -0.0845176 -0.0259599 0.0014414 -0.0814084 0.0244739 0.0638904 -0.0609361 0.0602605 -0.0529817 -0.0828476 0.0267737 0.0027707 0.0871349 0.0331764 -0.0565661 -0.0546943 -0.0526174 -0.0624808 -0.0602414 -0.1097355 -0.048903 -0.0020508 0.0232659 0.0586939 0.0072897 0.0590637 -0.0584882 -0.0588896 0.1146539 -0.0408526 0.0023206 0.0312897 -0.0506305 0.0064252 -0.0510962 -0.0677002 1.0215816 0.3988066 0.0134187 0.4492424 0.1152953 0.0254292 0.0071744 0.0155086 -0.1027762 1.0130498 -0.4076105 -0.0143453 -0.4569919 0.1253235 -0.0091359 -0.0238133 0.0007917 -0.1048998 0.0656833 -0.0001232 0.0101943 -0.009245 0.1332728 -0.0074534 0.2391672 -0.0089929 0.3151758 0.0619065 -0.0783097 -0.0123288 -0.0566079 -0.0526357 -0.0932756 0.0008723 -0.0901414 0.1237433 0.0632317 0.0774459 -0.0055403 0.054658 -0.0677736 0.0781824 0.005829 0.0748096 0.1374163 0.0068041 0.0514166 0.0583844 0.0714278 0.0592438 -0.045937 0.0914825 -0.0380844 0.1187095 0.0054039 -0.0555867 0.0539814 -0.0783085 0.0543288 0.0400434 0.0855879 0.0318505 0.1252348 -0.0031406 0.0625022 0.0500717 0.0560225 0.069327 -0.0492118 0.0604981 -0.0438573 0.1361162 -0.004857 -0.0657902 0.0448728 -0.0602276 0.0636363 0.0425805 0.055487 0.0371766 0.1434536 0.0843699 -0.0239203 -0.0044514 -0.035352 -0.0084693 -0.076685 -0.023794 -0.0686016 0.1297139 0.0850715 0.0229102 -0.0019716 0.035831 -0.0199323 0.0646641 -0.0205138 0.0568436 0.1405016 unknown
polarizability: 299.0547032|-0.39462|139.612349|-9.2725225|2.797812|70.0723155 unknown
InChI: InChI=1S/C12H9Cl2N/c13-9-1-5-11(6-2-9)15-12-7-3-10(14)4-8-12/h1-8,15H
charge 0 multiplicity 1
24 atoms
Cl -5.581316 -1.112462 -0.086116
Cl 5.571208 -1.17221 -0.011518
N  0.007145 1.239482 0.036052
C  -1.272196 0.638995 0.020614
C  1.280035 0.6260 0.006036
C  -2.376588 1.388925 0.51719
C  2.39407 1.401897 -0.424813
C  -1.514895 -0.653933 -0.52376
C  1.507313 -0.709063 0.445091
C  -3.684972 0.867545 0.478141
C  3.697031 0.865607 -0.422841
C  -2.821291 -1.184732 -0.551704
C  2.808188 -1.253938 0.434889
C  -3.892375 -0.421717 -0.049072
C  3.889142 -0.46392 -0.000266
H  0.012578 2.259816 0.076927
H  -2.209158 2.384387 0.945942
H  2.238532 2.430388 -0.77229
H  -0.697046 -1.232739 -0.960619
H  0.682138 -1.312474 0.83174
H  -4.52571 1.451948 0.862619
H  4.545341 1.470344 -0.755772
H  -3.00114 -2.176325 -0.977361
H  2.976167 -2.278521 0.77959
