program: Gaussian 09
title: 000234108
version: EM64L-G09RevD.01
frameworkgroup: C1[X(C16H15NO2)]
method: RPBEPBE
basis: SDD
operation: Freq
keyword: #p
keyword: freq=noraman
keyword: PBEPBE/SDD
title: #p freq=noraman PBEPBE/SDD
converged: YES YES NO NO
title: Mulliken charges:
elementType: O O N C C C C C C C C C C C C C C C C H H H H H H H H H H H H H H H
charge: -0.264180 -0.262974 -0.017391 -0.377377 0.419943 0.509124 -0.361857 -0.426430 -0.406595 -0.363162 -0.357475 -0.349768 -0.358088 -0.345749 0.316721 0.314469 -0.198871 -0.538153 -0.538528 0.258369 0.243026 0.234815 0.251531 0.244336 0.251806 0.253020 0.243106 0.242349 0.221754 0.222872 0.246309 0.221939 0.247146 0.223960
chargesum: 0.00000
title: Mulliken charges with hydrogens summed into heavy atoms:
elementType: O O N C C C C C C C C C C C C C C C C
charge: -0.264180 -0.262974 -0.017391 -0.119008 0.419943 0.509124 -0.118831 -0.191614 -0.155064 -0.118826 -0.105668 -0.096747 -0.114982 -0.103400 0.316721 0.314469 -0.198871 0.152783 0.154517
polarizability: 2.45057013e+02 -4.49749013e+00 1.65947385e+02 1.82859638e+01 -4.00260324e+00 1.43738911e+02
1716.lowfreq: -3.8939 -0.0003 0.0002 0.0003 3.2197 10.9558 17.6534 24.5838 36.2496
frequency: 17.1773 24.5757 36.2079 67.1630 93.7493 103.0349 110.7462 145.2908 159.3913 193.6752 223.1957 232.7913 244.1180 282.3183 307.0842 327.1008 348.3057 393.2305 413.2959 414.4004 426.4710 475.0971 493.4119 510.4377 535.8861 569.3090 580.7460 627.4903 631.2551 708.3865 729.2458 753.3251 763.3289 800.6622 815.9946 823.0738 829.6193 847.1883 857.3632 941.5078 950.4804 960.6972 968.8243 973.0163 987.4748 990.3651 1003.5829 1005.3021 1111.9676 1112.2850 1112.4273 1119.0772 1156.8435 1157.8410 1179.1071 1183.8418 1189.0281 1197.3173 1224.4446 1234.5579 1235.0502 1262.6970 1310.5274 1312.2626 1378.6716 1384.8395 1419.4202 1420.5682 1436.5919 1437.5704 1467.2326 1467.4554 1472.4734 1473.1761 1500.2107 1502.6616 1584.5925 1587.5642 1621.9845 1625.4885 2188.9316 2960.5201 2961.6643 2968.5925 3048.6846 3050.2698 3123.0078 3126.5731 3127.5103 3129.9212 3133.4773 3135.7190 3162.3640 3163.4692 3167.7468 3168.7721
redmass: 3.6748 4.0148 4.4883 4.9268 3.7993 4.5777 7.7083 4.4310 4.0143 3.9340 1.7480 1.2817 1.7107 4.5246 4.2090 4.9506 6.0398 7.1822 2.9666 3.0335 5.5662 4.1930 4.4274 2.8855 3.1463 4.6356 5.2708 6.8917 7.1205 3.5225 3.8782 4.9091 4.5390 3.2748 1.3552 1.3145 1.6846 2.1001 3.5187 1.5330 1.3767 1.3739 1.4144 3.4157 8.6882 7.8818 2.7024 2.6770 1.3660 1.2624 1.2596 1.3505 1.3578 1.3345 1.4863 1.6292 1.3877 1.7142 1.7600 3.4239 3.6965 1.4565 1.2914 1.3135 5.1832 4.8956 3.2600 3.6404 1.1666 1.1814 1.0501 1.0500 1.0805 1.0750 2.3628 2.4176 7.1280 7.0799 6.3728 6.2949 12.5856 1.0330 1.0330 1.0812 1.1040 1.1041 1.0900 1.0993 1.0992 1.0894 1.0893 1.0889 1.0943 1.0944 1.0956 1.0952
irintensity: 1.3288 0.5202 0.7209 0.9600 4.5350 5.8716 6.3784 1.5404 3.1844 1.7654 1.1969 0.0162 0.9003 0.6239 3.3513 1.2882 2.6029 2.6389 0.2898 0.2285 0.8475 1.1048 5.9666 12.2876 16.0564 39.5360 20.4754 2.8944 0.6529 3.4441 3.9784 2.1199 8.6975 39.7061 18.5803 1.2683 52.6990 26.4372 18.9833 0.2694 0.1413 0.2299 1.3344 6.1098 42.8232 33.9847 9.8988 13.8985 12.1766 0.7978 0.2381 10.0868 1.1743 2.5156 64.4209 62.0468 34.5640 6.0972 7.2665 105.0354 251.4471 8.0798 0.7731 1.0880 13.0147 12.5992 0.3836 5.0661 10.4898 10.9677 13.1812 13.7009 88.0878 37.3481 166.7607 70.6921 8.9192 18.8829 71.2340 33.3961 11.4860 67.8778 62.1114 6.5283 47.4357 45.8041 12.1142 27.7291 28.4997 8.8091 6.1165 3.7461 12.5905 11.2295 4.6240 4.8447
temp: 298.150 k
press: 1.00000 atm
elementType: 8 8 7 6 6 6 6 6 6 6 6 6 6 6 6 6 6 6 6 1 1 1 1 1 1 1 1 1 1 1 1 1 1 1
symmnumber: 1
zpe: 700972.2 jmol-1
zpe.correction: 0.266986 hartree
zpe.thermalcorrener: 0.284723 hartree
zpe.thermalcorrenthalpy: 0.285668 hartree
zpe.thermalcorrgfe: 0.219023 hartree
zpe.sumelectzpe: -822.502948 hartree
zpe.sumelectthermal: -822.485211 hartree
zpe.sumelectthermalent: -822.484267 hartree
zpe.sumelectthermalfe: -822.550911 hartree
dipole: -0.8667 -3.8421 -0.5173
dipole: 3.9725
quadrupole: -88.9435 -124.9896 -104.9880
quadrupole: -7.0608 2.7884 13.5851
quadrupole: 17.3636 -18.6825 1.3190 -7.0608 2.7884 13.5851
hfenergy: -822.7699341 hartree
pointgroup: C01 [X(C16H15N1O2)]
dipole: 0.339489 1.5237517 -0.0745913 debye
polarizability: 243.2673157|-2.5616239|165.002191|-22.8639386|6.1510274|146.4738022 unknown
InChI: InChI=1S/C16H15NO2/c1-18-14-7-3-12(4-8-14)16(11-17)13-5-9-15(19-2)10-6-13/h3-10,16H,1-2H3
charge 0 multiplicity 1
34 atoms
O  4.682932 1.838134 0.09725
O  -4.955389 1.397597 0.303231
N  -0.077846 -3.483138 -1.569557
C  0.009344 -1.560964 0.287971
C  1.273581 -0.685173 0.16532
C  -1.302504 -0.750881 0.2648
C  1.451536 0.378222 1.091589
C  -2.262572 -0.912142 1.294864
C  2.27008 -0.904537 -0.809151
C  -1.577107 0.155688 -0.783994
C  2.592084 1.194703 1.04462
C  -3.466305 -0.183572 1.282748
C  3.423801 -0.08725 -0.874012
C  -2.780276 0.892137 -0.81529
C  3.586044 0.96509 0.057746
C  -3.729941 0.72171 0.224795
C  -0.031484 -2.625144 -0.741537
C  5.738042 1.642593 -0.900315
C  -5.282768 2.336174 -0.773866
H  0.050936 -2.084499 1.266366
H  0.681827 0.57386 1.847461
H  -2.070657 -1.615639 2.114456
H  2.157044 -1.720841 -1.531718
H  -0.84137 0.295424 -1.584456
H  2.737773 2.014931 1.753949
H  -4.213373 -0.299278 2.073538
H  4.175503 -0.285012 -1.643946
H  -2.964482 1.585354 -1.641301
H  5.348124 1.770192 -1.928981
H  6.205255 0.643408 -0.801679
H  6.483043 2.422835 -0.686674
H  -4.546698 3.161926 -0.825874
H  -6.272433 2.737868 -0.512111
H  -5.335447 1.82212 -1.753141
