program: Gaussian 09
title: 000234105
version: EM64L-G09RevD.01
frameworkgroup: C1[X(C21H23NO6)]
method: RPBEPBE
basis: SDD
operation: Freq
keyword: #p
keyword: freq=noraman
keyword: PBEPBE/SDD
title: #p freq=noraman PBEPBE/SDD
converged: YES YES NO NO
title: Mulliken charges:
elementType: O O O O O O N C C C C C C C C C C C C C C C C C C C C C H H H H H H H H H H H H H H H H H H H H H H H
charge: -0.270985 -0.308567 -0.296893 -0.337019 -0.394056 -0.273729 -0.381765 -0.366755 -0.414321 -0.649273 0.534302 0.515030 -0.072727 0.364045 0.089447 -0.664657 -0.565627 -0.287393 -0.006556 0.257920 0.089377 0.237961 -0.368207 0.148262 -0.772648 -0.517521 -0.526097 -0.526839 0.283119 0.236601 0.228593 0.233357 0.237149 0.337780 0.269423 0.250155 0.211324 0.241380 0.251505 0.255847 0.207831 0.238787 0.267449 0.205834 0.226526 0.254952 0.233822 0.225012 0.256351 0.233551 0.378944
chargesum: 0.00000
title: Mulliken charges with hydrogens summed into heavy atoms:
elementType: O O O O O O N C C C C C C C C C C C C C C C C C C C C C
charge: -0.270985 -0.308567 -0.296893 -0.337019 -0.015112 -0.273729 -0.043985 -0.083635 0.050873 -0.178767 0.534302 0.515030 -0.072727 0.364045 0.089447 -0.395234 -0.315472 -0.076069 -0.006556 0.257920 0.089377 0.237961 -0.126826 0.148262 -0.057466 0.194549 0.189203 0.188074
polarizability: 3.95818622e+02 -1.10600511e+01 2.45872043e+02 -5.03865548e+00 1.74728197e+01 2.05026122e+02
1716.lowfreq: -9.5299 -6.9600 -0.0007 -0.0001 0.0005 4.9818 21.6952 26.0711 38.2491
frequency: 21.3801 25.9742 38.0763 47.7363 51.2816 61.9137 64.7250 70.4887 78.7763 97.0421 102.9058 113.1415 141.2970 148.8306 160.0467 167.6992 170.0464 180.9217 184.2243 208.2639 228.9941 237.7434 254.9050 263.3010 280.6024 298.9236 307.3034 330.8255 339.3559 356.7674 376.7910 381.8377 390.7123 405.1034 433.3408 459.4561 473.3860 486.3677 493.8992 529.8546 542.9860 567.3781 575.1934 586.5193 610.0583 613.2694 630.6354 665.6922 696.4177 714.2623 720.1779 727.5635 742.5815 776.3192 783.8683 792.7267 837.3277 847.2866 865.0605 869.0914 877.0512 881.3768 908.5243 916.0601 942.2678 954.1789 973.0644 976.9641 996.2221 1010.6858 1041.3549 1043.5692 1061.3677 1072.4264 1097.0833 1107.8054 1110.2531 1111.9799 1113.8385 1130.6512 1149.9021 1153.7467 1157.2622 1173.3187 1201.1208 1225.7354 1229.7592 1248.7749 1255.1690 1259.9976 1276.0449 1297.3407 1310.3123 1325.6851 1334.2441 1338.0127 1346.2234 1362.5762 1378.6144 1386.0121 1409.6965 1416.8547 1430.9090 1435.2120 1440.3734 1448.0333 1448.6550 1453.0923 1454.7660 1459.5288 1461.4781 1465.3524 1472.7441 1473.8853 1476.2909 1480.5598 1485.0116 1487.6800 1545.0316 1548.0928 1587.1255 1595.7317 1619.6871 1630.4072 2973.1750 2973.7489 2978.5726 2980.7428 2987.8079 2994.0595 2994.3887 3038.4520 3048.0280 3061.9770 3073.0300 3078.5155 3085.4611 3096.4090 3100.2121 3116.4953 3117.9341 3123.1718 3127.2254 3133.9414 3140.4143 3156.5888 3560.4953
redmass: 5.5852 4.4944 5.3400 5.2396 3.7665 2.9063 1.2968 3.9240 3.6934 2.6736 2.1518 2.3382 1.7862 1.4721 2.7936 4.2234 2.9259 1.1609 2.9991 4.5486 5.0213 5.4878 3.6291 5.0200 5.2056 4.0699 6.5636 3.4822 4.5790 5.1293 5.9816 4.5304 4.2677 4.1016 4.0432 6.5505 5.2967 4.9255 3.3502 3.6016 5.9393 2.4907 4.8467 2.7848 3.1618 2.5298 4.2630 4.6934 6.2396 4.9699 4.1320 5.8736 5.0863 5.6560 5.1503 4.1991 2.5781 1.3426 1.2656 4.9702 2.1907 2.0087 4.6180 1.6182 8.1148 3.7903 2.0907 1.4441 4.0517 1.9520 1.6721 3.4011 3.6146 2.8616 3.5838 1.3387 1.8731 1.4391 1.3443 2.9386 1.3660 1.4310 1.4490 1.3705 1.9073 1.4465 2.5248 1.6805 1.9350 2.3878 1.6835 1.7825 3.0638 1.5325 1.6206 5.7470 1.5167 1.6586 2.4615 1.2289 3.0326 1.3644 1.3290 1.6645 1.3898 1.5561 1.0498 1.2008 1.2098 1.1098 1.1485 1.2358 1.5185 1.0560 1.1274 4.0451 1.0693 1.0672 4.7220 5.9870 5.8964 6.4798 6.0670 7.0126 1.0321 1.0342 1.0311 1.0609 1.0601 1.0617 1.0376 1.0858 1.0981 1.1027 1.1048 1.1038 1.0956 1.1003 1.0982 1.0874 1.0859 1.1028 1.1033 1.1052 1.0917 1.0920 1.0772
irintensity: 2.2232 0.8862 0.3300 0.2391 6.7453 2.9661 1.8377 1.5850 0.8931 6.1009 6.2545 1.7872 0.7109 0.3804 2.5157 0.8762 9.2269 0.2541 1.2709 1.3062 16.2992 6.1501 1.6569 5.2249 3.3118 10.0207 1.7887 2.0010 15.7918 0.7294 8.2831 1.3952 3.3356 1.6567 3.9330 33.0743 2.5792 6.4904 6.6754 4.3401 1.5561 37.4392 13.1726 20.5361 5.3967 6.0704 5.8633 14.6941 3.8368 13.8481 1.0498 8.1312 5.2241 6.8886 1.5595 3.5867 10.2697 111.1795 9.7398 2.3950 16.5420 28.1905 48.1348 23.5883 49.2234 4.7662 24.8288 6.0104 91.7231 14.7694 2.2948 101.7156 20.4218 11.1487 42.8260 1.3199 8.3365 11.7874 11.8932 5.7368 4.3248 7.0753 15.7038 5.2789 46.5140 26.7583 146.8731 40.1662 401.4167 57.9245 29.3942 30.8459 86.3175 18.1149 44.3938 0.3966 80.0478 113.3518 53.7454 56.4630 95.7635 34.7782 29.4156 330.6569 15.9792 8.4987 11.3475 19.3693 12.3201 11.7076 21.9799 130.4818 120.1779 6.5850 24.9720 27.1907 27.0444 19.3064 45.6520 61.5019 3.7478 55.6123 177.8892 74.5511 85.6650 36.6432 103.0135 116.6411 18.9061 42.0805 6.2914 2.9158 27.3231 32.0057 25.3496 22.5864 31.1094 24.3674 7.0184 5.8163 7.4566 23.2734 21.5896 7.7758 11.2600 3.1874 56.3750
temp: 298.150 k
press: 1.00000 atm
elementType: 8 8 8 8 8 8 7 6 6 6 6 6 6 6 6 6 6 6 6 6 6 6 6 6 6 6 6 6 1 1 1 1 1 1 1 1 1 1 1 1 1 1 1 1 1 1 1 1 1 1 1
symmnumber: 1
zpe: 1052906.9 jmol-1
zpe.correction: 0.401031 hartree
zpe.thermalcorrener: 0.428942 hartree
zpe.thermalcorrenthalpy: 0.429886 hartree
zpe.thermalcorrgfe: 0.341420 hartree
zpe.sumelectzpe: -1318.015585 hartree
zpe.sumelectthermal: -1317.987674 hartree
zpe.sumelectthermalent: -1317.986730 hartree
zpe.sumelectthermalfe: -1318.075196 hartree
dipole: -9.2069 -3.6031 1.0256
dipole: 9.9398
quadrupole: -180.1322 -171.4673 -154.6259
quadrupole: -2.3369 10.3120 6.1621
quadrupole: -11.3904 -2.7255 14.1159 -2.3369 10.3120 6.1621
hfenergy: -1318.4166161 hartree
pointgroup: C01 [X(C21H23N1O6)]
dipole: 3.6469881 1.392601 0.230666 debye
polarizability: 395.6478022|-12.7301951|246.7056626|-5.9727576|-15.9135156|204.3633219 unknown
InChI: InChI=1S/C21H23NO6/c1-11(23)22-15-7-5-12-9-18(26-2)20(27-3)21(28-4)19(12)13-6-8-16(24)17(25)10-14(13)15/h6,8-10,15,22,24H,5,7H2,1-4H3
charge 0 multiplicity 1
51 atoms
O  0.842373 1.47765 -1.558252
O  3.678266 1.220163 -1.307985
O  4.740218 -0.042974 1.074627
O  -5.510021 0.257853 0.420411
O  -5.030031 2.715088 0.148711
O  -1.593303 -3.968399 -1.234138
N  -0.271537 -2.253044 -0.366512
C  -1.212441 -1.931373 0.7255
C  -0.599946 -2.143942 2.146992
C  0.144674 -0.908872 2.72841
C  -1.843291 -0.527251 0.565338
C  1.082301 -0.281165 1.714323
C  0.528759 0.417671 0.597023
C  -0.959212 0.619796 0.482107
C  1.417707 0.943365 -0.393317
C  2.481628 -0.389691 1.861269
C  -3.245019 -0.534596 0.533758
C  -1.36781 1.960208 0.329713
C  2.826289 0.777387 -0.265385
C  3.355848 0.152614 0.897141
C  -4.230016 0.508621 0.412518
C  -0.549889 -3.248977 -1.294902
C  -2.648537 2.5608 0.224172
C  -3.898664 1.947925 0.257471
C  0.495594 -3.422701 -2.393212
C  1.316236 2.797809 -2.033233
C  4.301395 0.108967 -2.071181
C  5.569691 1.187111 1.082225
H  -2.010605 -2.683342 0.597626
H  0.083322 -3.011539 2.084935
H  -1.416403 -2.418606 2.84209
H  0.702593 -1.215892 3.630988
H  -0.606974 -0.162953 3.051071
H  0.571178 -1.687232 -0.474796
H  2.916121 -0.891996 2.730937
H  -3.723653 -1.520961 0.600544
H  -0.544178 2.684228 0.303722
H  -2.670789 3.65186 0.11424
H  0.868866 -4.461049 -2.376741
H  0.013694 -3.262468 -3.373039
H  1.350402 -2.730253 -2.297657
H  0.700954 3.01136 -2.919973
H  2.386412 2.762329 -2.290308
H  1.139133 3.569095 -1.258299
H  3.520175 -0.487272 -2.57894
H  4.89816 -0.533889 -1.399372
H  4.95039 0.591309 -2.817761
H  5.299227 1.815745 1.951157
H  5.440145 1.757979 0.146464
H  6.606736 0.8338 1.183302
H  -5.789474 2.023506 0.210524
