program: Gaussian 09
title: 000234099
version: EM64L-G09RevD.01
frameworkgroup: C1[X(C18H14S)]
method: RPBEPBE
basis: SDD
operation: Freq
keyword: #pfreq=noraman
keyword: PBEPBE/SDD
title: #p freq=noraman PBEPBE/SDD
converged: NO NO NO NO
title: Mulliken charges:
elementType: S C C C C C C C C C C C C C C C C C C H H H H H H H H H H H H H H
charge: 0.218650 0.223200 0.546310 0.480578 -0.427501 0.152674 0.418416 -0.641669 -0.475144 -0.344268 0.315740 -0.490189 -0.447709 -0.857777 -0.372457 -0.305934 -0.845883 -0.243455 -0.238136 0.242112 0.259830 0.239894 0.228874 0.255044 0.238117 0.238120 0.233529 0.243584 0.233260 0.231715 0.233247 0.227509 0.229721
chargesum: 0.00000
title: Mulliken charges with hydrogens summed into heavy atoms:
elementType: S C C C C C C C C C C C C C C C C C C
charge: 0.218650 0.223200 0.546310 0.480578 -0.427501 0.152674 0.418416 -0.399558 -0.215314 -0.344268 0.315740 -0.250295 -0.218835 -0.126497 -0.138928 -0.062349 -0.147661 -0.015946 -0.008415
polarizability: 4.03203235e+02 -3.70425280e+00 2.17352601e+02 -1.72585480e-03 1.66591710e-03 8.74276375e+01
1716.lowfreq: -0.0011 0.0008 0.0016 7.0821 8.4182 14.5383 51.6337 74.0517 117.8627
frequency: 51.5394 73.9813 117.8517 130.1721 154.8599 177.8342 183.8905 187.3214 226.3611 246.0385 307.6259 311.6485 344.5020 351.7288 382.8028 422.3271 437.7042 439.8647 478.4402 492.4243 524.9469 538.0323 543.7640 557.4383 599.0050 627.9181 678.6650 690.3373 698.4186 709.0073 739.3140 769.9083 772.1842 786.7956 818.8850 865.1860 866.7862 883.1270 914.8491 915.7475 945.2956 969.2024 983.0274 991.9297 1020.4296 1025.6468 1038.9651 1051.8548 1062.4689 1071.9370 1096.5484 1127.0487 1172.7983 1183.5791 1209.2505 1237.5781 1246.2963 1262.4679 1295.6707 1321.7876 1373.8426 1388.6619 1397.4393 1404.7107 1416.7675 1428.0041 1429.5352 1443.0822 1462.6182 1469.1381 1478.0313 1489.5422 1494.3054 1501.4779 1572.0510 1579.2194 1598.3965 1614.0505 1624.7659 2970.0715 2971.2167 3037.8148 3046.5981 3078.5512 3103.6790 3115.1104 3123.3689 3126.6472 3135.5732 3140.3908 3149.5056 3159.2559 3165.3879
redmass: 4.7224 3.9234 3.7930 4.8891 1.1962 3.8987 1.8813 1.3149 4.7399 4.5372 5.3186 3.9514 2.8813 4.2955 8.2241 2.8935 3.1351 4.0268 8.7715 6.1334 4.0309 5.3779 3.3650 4.3966 3.3943 6.8556 6.0192 6.6376 4.6718 6.5218 1.9020 1.8440 5.0639 2.1201 1.4758 1.4018 2.7435 1.5433 4.6290 1.7297 1.4013 1.4040 1.3259 1.5568 2.8694 1.4426 3.5956 1.6423 2.5509 2.4889 2.2113 1.6386 1.0982 1.6320 1.6043 2.2082 2.1349 1.4375 2.4278 3.0464 3.6642 4.0161 1.2897 1.2213 3.7756 2.7174 5.6293 2.4857 1.9436 1.0466 1.7655 1.4397 1.0454 2.1040 6.5861 6.3996 6.7908 6.7630 7.1294 1.0404 1.0380 1.0970 1.0975 1.0980 1.0942 1.0863 1.0908 1.0865 1.0891 1.0978 1.0947 1.0910 1.1005
irintensity: 1.2117 0.0055 0.0412 0.7877 0.0797 0.0507 1.8154 0.8854 0.2009 2.4678 0.7096 3.3546 0.3289 0.9558 0.9182 6.8840 4.9822 2.8027 0.0311 5.4514 3.0512 1.0911 1.1917 0.4634 6.2861 13.2903 2.9815 5.8314 2.2856 0.0408 42.1370 37.3764 2.8711 14.6713 16.9970 1.3920 0.8231 28.8430 7.9699 22.5129 1.0095 5.3585 0.0000 17.3810 24.1390 7.7867 6.9882 0.7557 11.8094 2.2230 8.1321 2.2158 2.1000 7.8327 5.0429 12.0304 12.4158 1.4892 1.3085 6.7221 1.0017 6.8989 6.4559 17.7748 10.1374 15.0326 19.3963 29.3338 3.3819 24.6716 8.6772 0.5137 0.3212 42.4217 3.5936 5.9849 2.3499 5.8697 41.7347 23.0474 52.1302 20.0710 18.4208 22.9097 22.8805 5.2852 7.9198 2.0210 2.8445 37.4871 20.8329 3.0374 36.8444
temp: 298.150 k
press: 1.00000 atm
elementType: 16 6 6 6 6 6 6 6 6 6 6 6 6 6 6 6 6 6 6 1 1 1 1 1 1 1 1 1 1 1 1 1 1
symmnumber: 1
zpe: 680805.7 jmol-1
zpe.correction: 0.259305 hartree
zpe.thermalcorrener: 0.274599 hartree
zpe.thermalcorrenthalpy: 0.275543 hartree
zpe.thermalcorrgfe: 0.217483 hartree
zpe.sumelectzpe: -1091.126734 hartree
zpe.sumelectthermal: -1091.111440 hartree
zpe.sumelectthermalent: -1091.110496 hartree
zpe.sumelectthermalfe: -1091.168556 hartree
dipole: 0.9780 -0.6655 0.0001
dipole: 1.1830
quadrupole: -96.0287 -106.8115 -125.9876
quadrupole: 4.1614 0.0002 0.0003
quadrupole: 13.5806 2.7978 -16.3783 4.1614 0.0002 0.0003
hfenergy: -1091.3860389 hartree
pointgroup: C01 [X(C18H14S1)]
dipole: 0.3808072 -0.267597 0.0000368 debye
polarizability: 403.0496822|-6.4989008|217.5061538|-0.0017006|0.0016917|87.4276375 unknown
InChI: InChI=1S/C18H14S/c1-11-7-8-13-9-16-14-5-3-4-6-17(14)19-18(16)10-15(13)12(11)2/h3-10H,1-2H3
charge 0 multiplicity 1
33 atoms
S  -1.94538 2.2965 -0.000052
C  1.795254 0.431773 -0.00011
C  -1.000709 -0.253431 -0.000092
C  1.358514 -0.953374 -0.000119
C  -0.553188 1.120558 -0.00008
C  3.211184 0.744247 -0.000115
C  -2.462977 -0.368252 -0.00008
C  -0.036335 -1.266796 -0.000112
C  0.796084 1.463323 -0.000087
C  -3.11785 0.902659 -0.000058
C  4.154881 -0.302603 -0.000141
C  2.348634 -1.990682 -0.000128
C  3.701968 -1.66876 -0.000142
C  3.646042 2.200554 -0.000056
C  -3.256285 -1.541819 -0.000087
C  -4.521476 1.016284 -0.000044
C  5.654477 -0.042947 -0.000141
C  -4.663502 -1.440981 -0.000072
C  -5.292847 -0.168987 -0.000051
H  -0.337499 -2.321405 -0.000119
H  1.101001 2.513333 -0.000073
H  2.022513 -3.037715 -0.00013
H  4.455052 -2.465818 -0.000161
H  4.74207 2.30339 -0.000047
H  3.26361 2.737155 -0.890234
H  3.263614 2.737066 0.890179
H  -2.776594 -2.527219 -0.000104
H  -5.011288 1.995676 -0.000027
H  5.975966 0.531043 0.890022
H  6.214564 -0.993857 -0.000536
H  5.975874 0.531732 -0.889885
H  -5.274545 -2.350184 -0.000078
H  -6.386325 -0.099666 -0.00004
