program: Gaussian 09
title: 000234097
version: EM64L-G09RevD.01
frameworkgroup: C1[X(C16H14S)]
method: RPBEPBE
basis: SDD
operation: Freq
keyword: #pfreq=noraman
keyword: PBEPBE/SDD
title: #p freq=noraman PBEPBE/SDD
converged: YES YES NO NO
title: Mulliken charges:
elementType: S C C C C C C C C C C C C C C C C H H H H H H H H H H H H H H
charge: 0.217922 0.302141 -0.546881 0.292756 -0.540288 -0.412771 -0.411636 0.514396 -0.571770 -0.470886 -0.415594 0.419312 -0.345077 -0.377943 -0.300440 -0.242995 -0.240522 0.223791 0.218453 0.225148 0.220550 0.205235 0.208611 0.205704 0.208826 0.236175 0.247446 0.232440 0.242991 0.226155 0.228749
chargesum: 0.00000
title: Mulliken charges with hydrogens summed into heavy atoms:
elementType: S C C C C C C C C C C C C C C C C
charge: 0.217922 0.302141 -0.104637 0.292756 -0.094589 0.001074 0.002894 0.514396 -0.335594 -0.223440 -0.415594 0.419312 -0.345077 -0.145503 -0.057448 -0.016839 -0.011773
polarizability: 3.04166876e+02 -1.07546148e+01 1.90521583e+02 2.29927729e-01 -1.10638757e+00 8.73167543e+01
1716.lowfreq: -8.5010 0.0014 0.0018 0.0022 4.9900 7.0653 58.4108 77.0412 111.3147
frequency: 58.3999 77.0393 111.3105 140.8413 176.6506 195.0147 255.1659 279.7420 305.0096 331.6360 354.0969 387.8638 427.1545 436.0693 455.5244 472.1485 484.9562 523.7323 538.8555 609.0168 622.2363 639.2027 682.9834 714.4452 721.1204 728.7795 739.1912 772.3774 821.7073 861.5802 865.4980 871.4497 884.6023 895.7825 924.9783 943.3145 944.0434 981.1676 993.6354 1020.8554 1042.3048 1065.2991 1083.7935 1092.0276 1127.4554 1133.0351 1162.6862 1163.3856 1173.1174 1201.6654 1233.8993 1247.1919 1250.9047 1274.0154 1294.9190 1321.9623 1334.6964 1343.3713 1353.0596 1380.1985 1383.6559 1409.4198 1430.6796 1449.0690 1457.4919 1460.6126 1469.5606 1474.2362 1479.1445 1563.2197 1572.5614 1602.3942 1617.8639 2956.7333 2957.0758 2979.2818 2980.0572 3018.8157 3021.0338 3041.4318 3049.5666 3113.9246 3127.3876 3127.9967 3137.4370 3150.9286 3166.6284
redmass: 3.7726 3.2622 2.8928 4.8963 4.1368 3.5727 3.9339 4.9053 2.8301 2.5898 3.8555 8.1745 2.5983 3.1068 3.2252 4.2575 6.8342 4.4157 5.2970 4.0072 3.5947 3.6527 6.1982 4.4225 4.9118 4.5257 1.7425 1.9781 1.5009 1.4256 1.6123 2.4215 2.9494 1.5400 1.4709 2.6632 1.3980 1.3244 2.7315 2.8644 3.8050 2.4792 1.8619 1.6626 1.5991 1.1673 1.4120 2.7477 1.1432 1.9573 1.5285 1.5086 1.4226 1.2415 1.7563 1.5681 1.5901 1.4136 1.7351 5.0785 4.3239 4.9649 2.5308 1.5154 1.0854 1.7213 1.1069 1.1008 3.4200 6.8951 6.6155 6.9504 7.2201 1.0644 1.0645 1.0655 1.0605 1.0940 1.0951 1.0986 1.1043 1.0907 1.0855 1.0916 1.0890 1.0948 1.1005
irintensity: 0.7904 0.0544 0.9146 0.7094 1.0039 0.3957 0.3510 0.7849 1.1459 0.6853 1.4987 1.5619 13.2509 3.9506 0.2210 0.6784 0.6261 0.9759 0.1116 5.3368 1.4143 6.0883 4.4998 1.2782 2.0188 3.1862 47.7846 47.4491 9.1189 5.5879 4.0464 1.1468 9.4156 0.6172 20.1685 4.4952 1.0721 0.0001 4.7576 20.9470 10.2684 9.9918 0.4979 0.0928 2.3778 1.2871 0.4605 4.6934 0.5626 2.0951 1.4284 13.8714 5.7593 0.8120 4.3865 0.8969 0.3753 1.5921 2.8417 17.4540 4.4933 7.3471 19.3465 21.5935 17.4130 39.1314 12.6770 8.9762 4.9335 5.7785 1.5384 4.5025 8.2062 50.0710 4.9235 45.3708 29.2298 60.9495 7.2043 83.1139 66.2622 12.2798 1.6734 7.8256 4.6540 22.5590 33.0745
temp: 298.150 k
press: 1.00000 atm
elementType: 16 6 6 6 6 6 6 6 6 6 6 6 6 6 6 6 6 1 1 1 1 1 1 1 1 1 1 1 1 1 1
symmnumber: 1
zpe: 656309.5 jmol-1
zpe.correction: 0.249975 hartree
zpe.thermalcorrener: 0.263140 hartree
zpe.thermalcorrenthalpy: 0.264085 hartree
zpe.thermalcorrgfe: 0.210359 hartree
zpe.sumelectzpe: -1015.017871 hartree
zpe.sumelectthermal: -1015.004705 hartree
zpe.sumelectthermalent: -1015.003761 hartree
zpe.sumelectthermalfe: -1015.057487 hartree
dipole: -1.4633 -1.1618 0.0141
dipole: 1.8685
quadrupole: -90.5731 -99.0376 -112.6132
quadrupole: -2.3055 0.0779 -0.3376
quadrupole: 10.1682 1.7037 -11.8719 -2.3055 0.0779 -0.3376
hfenergy: -1015.2678457 hartree
pointgroup: C01 [X(C16H14S1)]
dipole: -0.5566645 -0.4800986 0.0062032 debye
polarizability: 304.8527573|-6.1062651|189.8348073|0.1161787|-1.145761|87.3176483 unknown
InChI: InChI=1S/C16H14S/c1-2-6-12-10-16-14(9-11(12)5-1)13-7-3-4-8-15(13)17-16/h3-4,7-10H,1-2,5-6H2
charge 0 multiplicity 1
31 atoms
S  1.582287 2.32952 -0.026766
C  -1.95181 -0.678181 0.012932
C  -3.049723 -1.740641 0.065103
C  -2.270683 0.716917 -0.009047
C  -3.719119 1.202302 -0.052631
C  -4.436189 -1.2073 -0.358035
C  -4.738304 0.120993 0.368874
C  0.45319 -0.136758 0.003081
C  -0.598146 -1.081978 0.015892
C  -1.226309 1.67473 -0.020331
C  0.111289 1.248365 -0.014444
C  1.898932 -0.365096 0.005615
C  2.650778 0.850306 -0.008656
C  2.6027 -1.595961 0.02139
C  4.058972 0.858885 -0.008155
C  4.011747 -1.601292 0.022173
C  4.737313 -0.380497 0.007425
H  -2.760034 -2.603889 -0.56473
H  -3.121511 -2.128225 1.103305
H  -3.827441 2.102929 0.582006
H  -3.953722 1.526584 -1.088509
H  -4.45709 -1.036086 -1.453064
H  -5.212254 -1.962372 -0.131001
H  -4.684031 -0.043147 1.463806
H  -5.764212 0.467002 0.141426
H  -0.361425 -2.153621 0.029688
H  -1.475219 2.742259 -0.034809
H  2.049248 -2.54189 0.03315
H  4.619795 1.799117 -0.019254
H  4.552618 -2.553675 0.034428
H  5.832658 -0.395799 0.008342
