program: Gaussian 09
title: 000234075
version: EM64L-G09RevD.01
frameworkgroup: C1[X(C16H21N3O)]
method: RPBEPBE
basis: SDD
operation: Freq
keyword: #p
keyword: freq=noraman
keyword: PBEPBE/SDD
title: #p freq=noraman PBEPBE/SDD
converged: YES YES NO NO
title: Mulliken charges:
elementType: O N N N C C C C C C C C C C C C C C C C H H H H H H H H H H H H H H H H H H H H H
charge: -0.249103 -0.467511 -0.050823 -0.691973 -0.015990 -0.364826 -0.574981 -0.715749 -0.710468 0.201397 0.495040 0.393071 -0.623558 -0.138502 0.370211 -0.363306 -0.334747 -0.491969 0.165733 -0.794847 0.192062 0.246202 0.195514 0.233913 0.215484 0.217555 0.205312 0.215757 0.205923 0.211911 0.219571 0.297051 0.180657 0.312823 0.261871 0.220246 0.223279 0.223553 0.254143 0.313402 0.316668
chargesum: 0.00000
title: Mulliken charges with hydrogens summed into heavy atoms:
elementType: O N N N C C C C C C C C C C C C C C C C
charge: -0.249103 -0.170460 -0.050823 -0.061903 0.176072 0.076891 -0.125584 -0.077124 -0.073062 0.201397 0.495040 0.393071 -0.442901 -0.138502 0.370211 -0.050483 -0.072876 -0.271723 0.165733 -0.093871
polarizability: 3.51209968e+02 -1.40759473e+01 2.05073293e+02 -1.20931479e+01 -1.96233996e+00 1.10486840e+02
1716.lowfreq: -3.1192 -0.0009 0.0007 0.0012 4.0387 8.5714 14.1618 24.6451 37.4350
frequency: 14.0043 24.6193 37.3570 48.6674 60.2320 78.4002 103.6323 122.2981 145.5408 158.5990 177.7939 187.0313 212.8256 235.8086 239.4446 246.3198 275.3826 299.6443 302.5165 346.4177 377.7965 392.5403 410.5274 416.8626 434.2527 455.5680 465.8228 505.0251 528.3479 538.8814 552.3461 579.2768 619.1152 640.8083 648.2383 684.9646 691.8638 755.3880 774.0594 781.3425 812.1704 828.7774 850.5476 855.1341 872.0255 892.6618 913.0648 932.1476 949.2153 957.1756 964.7297 973.0385 992.6589 1008.6768 1045.0743 1049.0890 1055.4764 1100.5899 1109.0130 1131.6357 1143.1150 1171.7064 1178.2982 1194.9992 1214.9438 1246.4254 1259.1124 1278.7306 1285.7825 1296.5828 1317.8256 1330.6182 1337.9790 1351.3946 1376.6514 1383.8907 1394.1043 1394.8019 1398.4277 1413.9349 1444.5369 1457.0931 1461.8518 1464.8063 1469.3753 1470.5288 1476.1253 1481.9349 1489.5755 1496.8267 1540.4562 1554.1942 1595.5611 1623.5376 1633.3851 1648.6785 2952.5977 2965.8253 2968.4101 2971.1539 2978.1504 2978.7514 3023.9905 3052.5835 3055.4846 3058.2387 3065.9437 3068.1390 3073.0011 3087.2385 3116.0182 3125.9901 3161.6888 3196.4273 3526.2305 3572.1907 3710.7289
redmass: 4.0922 2.8688 3.7773 3.4881 1.2491 3.1677 2.6926 2.9610 3.1998 3.5981 4.3686 3.4022 1.0738 3.5223 3.3288 1.2831 3.5170 2.3380 1.4817 3.7712 2.6453 2.6554 1.7609 2.3160 2.8464 1.8191 4.3204 3.9167 4.9188 5.3761 2.9006 3.7410 3.9152 4.1802 1.3565 3.6008 4.9419 2.2511 2.1980 2.0219 4.2467 2.9540 2.3672 1.4674 1.5829 4.3246 1.1788 1.6337 1.5686 3.1193 3.2734 1.8407 2.0511 1.3095 1.5705 1.6800 2.9840 1.5767 2.0867 2.2605 1.4244 2.3184 1.8285 1.6899 1.6502 1.6581 1.2416 1.6295 2.3042 1.5077 1.5363 1.5040 2.5362 1.6572 1.2183 1.2961 1.3421 2.7187 5.7863 5.0558 1.1014 1.3719 2.1114 1.0690 1.0472 1.0485 1.0743 1.0554 1.0572 2.9124 3.2307 6.1302 5.3043 4.8293 5.6009 1.2641 1.0813 1.0371 1.0455 1.0496 1.0622 1.0382 1.0981 1.1018 1.0972 1.0992 1.0990 1.0991 1.0992 1.0894 1.0978 1.0916 1.0904 1.0958 1.0761 1.0455 1.1029
irintensity: 0.1576 0.2309 0.3549 0.9123 1.5042 1.0193 0.5243 3.2182 5.6178 14.2578 0.0233 0.8752 0.0653 7.0403 1.4843 0.0630 7.1601 23.5532 50.8990 4.8901 1.3243 24.5998 125.3389 4.8198 2.6320 33.0149 3.5015 2.8997 0.7222 5.4752 14.6339 6.7272 0.0051 4.7667 55.5093 1.0374 2.7954 2.5188 5.0174 2.4042 8.2470 2.0310 47.6175 13.9228 70.4562 3.5537 4.5541 8.6086 2.9616 6.3178 6.4272 3.9141 6.9963 1.1864 6.5823 1.0060 14.8575 14.6349 23.6743 5.0649 4.5333 34.4586 26.2775 17.4615 25.0168 55.9050 31.3260 20.9130 1.5814 4.1142 5.6252 9.7261 65.3243 7.6169 16.9173 28.1143 44.8625 61.1824 157.0814 134.8421 10.7369 80.5814 13.5536 2.8025 15.6409 3.3821 8.3971 7.7083 44.1577 288.9009 207.1973 52.6874 183.7904 163.9330 16.3136 227.0684 13.7022 25.8925 22.1822 17.9518 50.3747 37.7398 7.0008 18.9528 23.0159 14.5928 53.8723 93.2911 66.5614 31.6958 8.5749 27.6458 4.4357 8.8147 6.3298 55.2360 19.8426
temp: 298.150 k
press: 1.00000 atm
elementType: 8 7 7 7 6 6 6 6 6 6 6 6 6 6 6 6 6 6 6 6 1 1 1 1 1 1 1 1 1 1 1 1 1 1 1 1 1 1 1 1 1
symmnumber: 1
zpe: 896296.3 jmol-1
zpe.correction: 0.341381 hartree
zpe.thermalcorrener: 0.362019 hartree
zpe.thermalcorrenthalpy: 0.362963 hartree
zpe.thermalcorrgfe: 0.289999 hartree
zpe.sumelectzpe: -860.345296 hartree
zpe.sumelectthermal: -860.324658 hartree
zpe.sumelectthermalent: -860.323714 hartree
zpe.sumelectthermalfe: -860.396678 hartree
dipole: 0.8300 7.5132 -0.2163
dipole: 7.5619
quadrupole: -108.5271 -112.0687 -124.5629
quadrupole: -9.1477 -1.3881 -1.5324
quadrupole: 6.5258 2.9842 -9.5100 -9.1477 -1.3881 -1.5324
hfenergy: -860.686677 hartree
pointgroup: C01 [X(C16H21N3O1)]
dipole: -0.304241 2.9195311 -0.4847624 debye
polarizability: 351.2200157|10.1075289|202.1124957|-16.0793954|-16.0129355|113.4375897 unknown
InChI: InChI=1S/C16H21N3O/c1-10(2)4-7-16(20)19-12-5-6-15-13(9-12)14(17)8-11(3)18-15/h5-6,8-10,19H,4,7,17H2,1-3H3
charge 0 multiplicity 1
41 atoms
O  -2.492156 -1.689369 0.845616
N  -1.347659 0.310857 0.376794
N  4.088305 -1.296897 0.119623
N  3.143516 2.828508 -0.492879
C  -6.330801 0.297555 0.073372
C  -4.925176 -0.319232 -0.14749
C  -3.796585 0.379066 0.649571
C  -6.406815 1.774613 -0.383974
C  -7.401232 -0.550413 -0.653996
C  -2.49896 -0.440733 0.631719
C  0.013022 -0.110929 0.317785
C  2.373889 0.523674 -0.022429
C  0.991785 0.864741 0.055184
C  2.772129 -0.853688 0.173689
C  3.42968 1.484181 -0.290485
C  0.403075 -1.47802 0.512611
C  1.752033 -1.821348 0.43923
C  4.754142 1.010697 -0.339703
C  5.04531 -0.373505 -0.132193
C  6.479369 -0.861988 -0.189287
H  -6.54639 0.262284 1.163497
H  -4.935733 -1.383342 0.154973
H  -4.682601 -0.297964 -1.230061
H  -4.114463 0.467536 1.70888
H  -3.62735 1.407531 0.27583
H  -5.717387 2.42329 0.187371
H  -6.148458 1.862726 -1.45762
H  -7.428326 2.176226 -0.249816
H  -7.224611 -0.548682 -1.747135
H  -8.416919 -0.150764 -0.476076
H  -7.3821 -1.601369 -0.310737
H  -1.502833 1.307838 0.210626
H  0.66368 1.904065 -0.089131
H  -0.367847 -2.223246 0.71422
H  2.077091 -2.856106 0.583732
H  5.579625 1.704343 -0.539192
H  6.936568 -0.651455 -1.174676
H  7.104186 -0.363281 0.575842
H  6.502275 -1.948156 -0.012256
H  3.895571 3.485618 -0.680167
H  2.196353 3.189333 -0.455357
