program: Gaussian 09
title: 000234074
version: EM64L-G09RevD.01
frameworkgroup: C1[X(C16H21N3O)]
method: RPBEPBE
basis: SDD
operation: Freq
keyword: #p
keyword: freq=noraman
keyword: PBEPBE/SDD
title: #p freq=noraman PBEPBE/SDD
converged: YES YES NO NO
title: Mulliken charges:
elementType: O N N N C C C C C C C C C C C C C C C C H H H H H H H H H H H H H H H H H H H H H
charge: -0.244290 -0.463622 -0.051049 -0.692103 -0.348883 -0.337216 -0.584736 -0.356447 0.198647 0.391623 0.487218 -0.137492 -0.619441 -0.695086 0.370685 -0.368078 -0.332152 -0.492089 0.165664 -0.795045 0.219646 0.216321 0.180755 0.180817 0.234863 0.231198 0.198781 0.198345 0.304312 0.180097 0.208282 0.218211 0.208449 0.312051 0.261598 0.220062 0.254039 0.223070 0.223545 0.316265 0.313184
chargesum: 0.00000
title: Mulliken charges with hydrogens summed into heavy atoms:
elementType: O N N N C C C C C C C C C C C C C C C C
charge: -0.244290 -0.159310 -0.051049 -0.062654 0.087084 0.024356 -0.118674 0.040679 0.198647 0.391623 0.487218 -0.137492 -0.439344 -0.060143 0.370685 -0.056028 -0.070554 -0.272027 0.165664 -0.094391
polarizability: 3.55146360e+02 1.05607165e+01 2.02165145e+02 7.33270498e-01 -9.19746525e-02 1.07109211e+02
1716.lowfreq: -16.5390 -0.0012 -0.0003 0.0008 4.4647 6.2992 20.3651 33.6985 41.1807
frequency: -10.4401 32.2877 41.1460 49.8261 55.1589 68.6038 96.9741 101.6574 117.4330 134.0914 158.1650 173.7693 187.2976 205.9393 227.8805 234.8664 262.2740 286.1161 312.2794 343.3068 387.3954 389.3434 411.7212 416.3604 455.5754 481.8133 504.3471 528.9286 543.2140 545.6016 565.3896 618.6773 623.0494 642.9417 683.8843 685.0375 726.0800 756.5152 758.6893 774.2397 812.9750 844.3103 850.3009 854.1430 871.3978 886.5418 900.0754 952.8281 958.0393 958.3168 992.1060 1008.6614 1015.7615 1044.7543 1049.4273 1070.3792 1076.4593 1101.3458 1105.6822 1114.2055 1142.7491 1162.3673 1194.9883 1198.0650 1241.1786 1247.3337 1259.1538 1279.9608 1286.6860 1289.2551 1295.8108 1302.0613 1334.2666 1349.2730 1359.7655 1382.5900 1390.2104 1394.3697 1398.9382 1413.7334 1441.2357 1457.9602 1461.6400 1464.8413 1469.3052 1470.2952 1477.2526 1479.5641 1489.0225 1498.1388 1541.0271 1554.7430 1595.3798 1630.8644 1635.6084 1649.8806 2949.4406 2955.3857 2971.4851 2972.4079 2978.2932 2991.5697 3000.9766 3003.2500 3025.0835 3055.0991 3063.1090 3069.5928 3072.1854 3085.0631 3115.6704 3124.9891 3161.3475 3197.4044 3514.8412 3571.9166 3710.6424
redmass: 2.7138 2.8742 4.3816 3.9157 2.9721 1.1352 2.1579 2.1818 4.0595 2.3842 3.6025 4.7772 3.4482 4.1716 1.1341 4.5562 5.7315 2.8580 1.2458 4.5646 3.3891 2.9189 1.7098 4.1037 1.8640 4.8081 3.9252 4.9313 2.9516 5.3905 2.6340 3.6678 5.1711 1.3260 5.6583 3.3916 1.0803 1.2392 4.3286 2.2088 5.1376 1.3132 2.3032 1.4794 1.5804 2.7998 2.7060 4.2442 1.6097 2.0173 2.0473 1.3084 3.8255 1.5711 1.6415 2.7817 2.1819 1.4253 2.1235 2.4248 1.4551 2.5717 1.6773 1.5691 1.5069 1.5704 1.2531 1.7538 1.0535 2.9579 1.1228 1.4825 3.0925 1.6775 1.7015 1.2911 1.2182 3.4223 6.0308 5.0238 1.1274 1.3591 2.0177 1.0754 1.0473 1.0719 1.0425 1.0687 1.0901 2.9734 3.1606 5.9707 5.2712 5.5094 5.1913 1.2596 1.0589 1.0588 1.0466 1.0489 1.0382 1.0987 1.0615 1.0979 1.1029 1.0972 1.1031 1.1014 1.0991 1.0894 1.0977 1.0917 1.0905 1.0956 1.0759 1.0455 1.1029
irintensity: 0.1282 0.2583 0.3678 1.6128 1.7516 0.0356 0.0046 1.4566 1.1146 2.2216 14.7031 0.0128 0.6308 0.1029 0.0062 0.0917 17.6329 2.4613 67.6676 2.8785 0.7247 21.4582 143.0216 11.3505 27.9587 0.3657 3.6395 0.6147 9.6709 2.0520 6.7163 0.3208 4.4953 59.9125 2.7192 0.6301 14.3812 0.1527 0.9034 5.0676 5.1246 5.5287 50.0817 12.9626 69.2724 0.6244 7.3304 30.9850 1.6858 3.2626 6.3148 1.1288 5.5821 6.4979 2.6060 1.4735 3.7081 0.3887 6.1680 1.5886 7.8721 118.3506 19.1114 0.3398 0.2417 77.1612 0.0186 21.7057 0.1223 12.5687 0.7018 6.2801 68.2722 7.5831 3.3613 27.9482 11.7363 105.5143 139.1303 133.4300 4.5586 83.6386 12.4046 0.2960 15.7081 1.2017 12.6542 6.2519 18.8292 320.7518 212.6646 48.2794 190.1924 158.9066 29.4150 229.9791 12.0945 25.5233 70.2292 18.9408 38.0435 8.2207 26.8108 10.2536 17.0611 23.1141 5.9876 133.7217 54.2819 32.4741 8.4720 27.9381 4.4300 8.0991 6.7100 55.1192 19.6739
temp: 298.150 k
press: 1.00000 atm
elementType: 8 7 7 7 6 6 6 6 6 6 6 6 6 6 6 6 6 6 6 6 1 1 1 1 1 1 1 1 1 1 1 1 1 1 1 1 1 1 1 1 1
symmnumber: 1
zpe: 896510.5 jmol-1
zpe.correction: 0.341463 hartree
zpe.thermalcorrener: 0.361346 hartree
zpe.thermalcorrenthalpy: 0.362290 hartree
zpe.thermalcorrgfe: 0.292122 hartree
zpe.sumelectzpe: -860.344203 hartree
zpe.sumelectthermal: -860.324320 hartree
zpe.sumelectthermalent: -860.323376 hartree
zpe.sumelectthermalfe: -860.393544 hartree
dipole: -0.6149 7.5535 0.0039
dipole: 7.5785
quadrupole: -109.6049 -110.7485 -124.2389
quadrupole: 10.5918 0.0419 -0.0753
quadrupole: 5.2592 4.1156 -9.3748 10.5918 0.0419 -0.0753
hfenergy: -860.6856663 hartree
pointgroup: C01 [X(C16H21N3O1)]
dipole: -0.2329975 2.971764 0.065064 debye
polarizability: 355.2040794|10.0715906|202.0621493|1.4869031|1.9730304|107.1544873 unknown
InChI: InChI=1S/C16H21N3O/c1-3-4-5-6-16(20)19-12-7-8-15-13(10-12)14(17)9-11(2)18-15/h7-10,19H,3-6,17H2,1-2H3
charge 0 multiplicity 1
41 atoms
O  -2.400021 -1.62207 -0.07327
N  -1.184923 0.390303 -0.012457
N  4.231562 -1.30191 -0.015793
N  3.396447 2.891449 0.065495
C  -4.933498 -0.309011 -0.007263
C  -6.195525 0.581101 -0.012107
C  -3.633805 0.517338 -0.035347
C  -7.508072 -0.235495 0.011657
C  -2.368128 -0.35802 -0.041695
C  2.559688 0.563001 0.012597
C  0.169199 -0.053184 -0.014772
C  2.921309 -0.837832 -0.014128
C  1.180539 0.924512 0.011767
C  -8.76977 0.654182 0.010069
C  3.647159 1.525071 0.038913
C  0.52324 -1.443704 -0.041581
C  1.869021 -1.807183 -0.040727
C  4.964717 1.030342 0.036681
C  5.21873 -0.376416 0.009243
C  6.646002 -0.887715 0.008451
H  -4.947624 -0.992069 -0.877273
H  -4.932454 -0.959166 0.888033
H  -6.176921 1.262154 0.86531
H  -6.190441 1.232513 -0.911928
H  -3.625315 1.168625 -0.934775
H  -3.602405 1.196876 0.842242
H  -7.529558 -0.91385 -0.865269
H  -7.513695 -0.888125 0.90817
H  -1.309673 1.405774 0.012291
H  0.88031 1.982008 0.03189
H  -8.786533 1.320358 0.893556
H  -9.693424 0.047053 0.027697
H  -8.803104 1.293768 -0.892381
H  -0.271497 -2.190793 -0.061701
H  2.166425 -2.860045 -0.060514
H  5.813357 1.724512 0.055992
H  6.639386 -1.98795 -0.024769
H  7.208728 -0.507684 -0.865234
H  7.189655 -0.562323 0.915742
H  2.453832 3.265893 0.066402
H  4.169978 3.550108 0.083886
