program: Gaussian 09
title: 000234072
version: EM64L-G09RevD.01
frameworkgroup: C1[X(C15H19N3O)]
method: RPBEPBE
basis: SDD
operation: Freq
keyword: #p
keyword: freq=noraman
keyword: PBEPBE/SDD
title: #p freq=noraman PBEPBE/SDD
converged: YES YES NO NO
title: Mulliken charges:
elementType: O N N N C C C C C C C C C C C C C C C H H H H H H H H H H H H H H H H H H H
charge: -0.244912 -0.463757 -0.051070 -0.692051 -0.329059 -0.574451 -0.343220 0.391474 0.487041 -0.137591 -0.619157 0.201455 0.370721 -0.367988 -0.332227 -0.692768 0.165868 -0.492075 -0.795020 0.215650 0.216366 0.230009 0.230785 0.188289 0.188298 0.180074 0.304046 0.311982 0.261622 0.214887 0.213340 0.213258 0.220073 0.254050 0.223042 0.223585 0.316225 0.313204
chargesum: 0.00000
title: Mulliken charges with hydrogens summed into heavy atoms:
elementType: O N N N C C C C C C C C C C C C C C C
charge: -0.244912 -0.159711 -0.051070 -0.062622 0.102957 -0.113656 0.033368 0.391474 0.487041 -0.137591 -0.439083 0.201455 0.370721 -0.056006 -0.070605 -0.051283 0.165868 -0.272002 -0.094343
polarizability: 3.37933525e+02 -9.14930945e+00 1.92676815e+02 -7.46034516e-02 2.15738877e-03 9.85221629e+01
1716.lowfreq: -20.9719 -0.0003 0.0008 0.0011 2.4664 5.3853 17.8183 33.4343 50.4481
frequency: -17.9017 32.8330 50.3263 52.0024 61.3413 70.1097 106.5916 114.2444 137.3744 157.3444 186.8410 193.7398 222.8418 228.1262 235.0441 288.0169 309.4191 309.9067 346.2757 388.5825 410.6673 415.0788 454.7501 478.0273 503.6713 528.2722 542.9758 544.5733 565.0445 618.3241 619.7061 642.9090 682.0678 684.8357 728.1482 759.8005 773.6800 796.9881 811.8779 849.6891 854.1842 871.3330 886.5945 906.1771 923.5498 949.8736 957.7864 991.8264 1008.4685 1037.7938 1044.5540 1049.0301 1085.2721 1097.9149 1099.5292 1108.5485 1142.5607 1164.3707 1194.5381 1206.3839 1243.9221 1257.6224 1279.7504 1281.6115 1289.1831 1289.6033 1324.5742 1338.6320 1359.7667 1382.1955 1390.5038 1394.3902 1398.4863 1413.3258 1441.4040 1457.8189 1460.9494 1467.2769 1468.8338 1475.4764 1475.8525 1488.4170 1498.1446 1540.8711 1554.4603 1595.0188 1630.6724 1635.4816 1648.3614 2954.5478 2961.1710 2975.3198 2978.4827 3001.7806 3002.0418 3006.0561 3055.3268 3061.7742 3074.1067 3074.4770 3084.8014 3115.9184 3124.9688 3161.2967 3197.8028 3514.8411 3572.1477 3711.0981
redmass: 2.3881 3.2459 4.3845 4.1992 1.3538 1.7598 2.7741 2.1181 4.1133 3.5975 3.4321 5.0430 1.1990 4.3133 3.8135 2.8798 1.2509 4.6368 4.6433 2.8662 1.7340 3.8220 1.8593 4.7596 3.8586 5.0024 2.8290 5.8974 2.6356 3.6873 5.2067 1.3229 5.8946 3.3743 1.1025 5.1270 2.1950 1.2828 5.0716 2.3395 1.4760 1.5813 3.2389 2.1764 1.3003 5.1154 3.0811 2.0588 1.3088 3.1448 1.5717 1.6589 2.1946 1.4591 2.1047 2.4800 1.4493 2.6263 1.6759 1.4723 1.6598 1.4712 1.7889 1.1812 1.0777 2.7961 1.8139 2.7042 1.6865 1.2840 1.2201 3.4425 6.0888 5.0198 1.1285 1.4134 1.9270 1.0735 1.0474 1.0421 1.0631 1.0837 2.9781 3.1559 5.9422 5.2194 5.4924 5.1641 1.2672 1.0590 1.0591 1.0360 1.0381 1.0869 1.0712 1.1014 1.0972 1.1028 1.0995 1.1014 1.0894 1.0978 1.0917 1.0905 1.0956 1.0759 1.0455 1.1029
irintensity: 0.1943 0.0223 2.4705 0.2215 0.6878 0.0573 0.4203 2.6548 1.8151 15.9272 0.6790 0.3122 0.0211 4.6710 0.1017 3.9700 69.4370 15.8135 1.8427 22.9743 139.1721 4.6779 28.3354 0.5469 3.3249 0.6858 10.4776 1.6195 6.7387 0.3190 5.6356 60.3550 2.8778 0.6198 13.5807 1.0946 5.2951 0.1588 3.9698 50.2965 13.5854 68.2459 1.4966 20.4285 5.0094 19.9471 4.9246 6.7144 1.1129 0.2847 6.4955 2.3822 2.6995 0.0525 1.5504 14.8160 4.9652 115.7399 20.1864 0.1145 42.6358 23.4847 24.9335 0.2783 0.6571 16.5206 11.7553 68.2400 1.8575 27.0849 5.8418 113.5203 127.3041 136.6390 4.4639 85.4928 8.3390 2.1130 15.7228 12.6197 3.2528 19.6497 311.7396 214.5588 46.7274 188.6178 161.4486 26.4158 232.1081 9.9048 46.4197 38.5812 37.3815 22.4542 24.2812 3.0104 23.1557 5.5173 52.5761 102.3926 32.5421 8.3914 27.9721 4.4285 8.0512 6.7658 55.2162 19.6256
temp: 298.150 k
press: 1.00000 atm
elementType: 8 7 7 7 6 6 6 6 6 6 6 6 6 6 6 6 6 6 6 1 1 1 1 1 1 1 1 1 1 1 1 1 1 1 1 1 1 1
symmnumber: 1
zpe: 822988.3 jmol-1
zpe.correction: 0.313460 hartree
zpe.thermalcorrener: 0.331987 hartree
zpe.thermalcorrenthalpy: 0.332932 hartree
zpe.thermalcorrgfe: 0.266068 hartree
zpe.sumelectzpe: -821.121195 hartree
zpe.sumelectthermal: -821.102667 hartree
zpe.sumelectthermalent: -821.101723 hartree
zpe.sumelectthermalfe: -821.168586 hartree
dipole: 0.4060 7.6361 0.0013
dipole: 7.6469
quadrupole: -102.3061 -103.7151 -117.8449
quadrupole: -5.8896 0.0267 -0.0202
quadrupole: 5.6492 4.2403 -9.8895 -5.8896 0.0267 -0.0202
hfenergy: -821.4346542 hartree
pointgroup: C01 [X(C15H19N3O1)]
dipole: 0.1543997 -3.0045605 0.0030841 debye
polarizability: 337.9654962|8.8916529|192.644681|0.1117846|-0.1078522|98.5223256 unknown
InChI: InChI=1S/C15H19N3O/c1-3-4-5-15(19)18-11-6-7-14-12(9-11)13(16)8-10(2)17-14/h6-9,18H,3-5,16H2,1-2H3
charge 0 multiplicity 1
38 atoms
O  2.904035 1.519577 0.006287
N  1.644199 -0.466072 0.002214
N  -3.732587 1.34846 -0.003378
N  -2.993119 -2.863587 0.003812
C  5.407887 0.149802 -0.001936
C  4.089749 -0.647277 0.007499
C  6.649696 -0.76916 0.003287
C  -2.103507 -0.554308 0.000743
C  0.300359 0.007797 0.001482
C  -2.433279 0.854718 -0.00131
C  -0.732926 -0.947047 0.002154
C  2.843808 0.256126 0.005134
C  -3.212781 -1.491654 0.001359
C  -0.022102 1.406273 -0.000488
C  -1.359222 1.80019 -0.001894
C  7.973562 0.025328 -0.005503
C  -4.740618 0.445402 -0.003128
C  -4.518725 -0.96694 -0.000639
C  -6.155835 0.989204 -0.003733
H  5.429183 0.808874 -0.890285
H  5.432464 0.823632 0.875113
H  4.052084 -1.318825 -0.876119
H  4.057247 -1.305489 0.901327
H  6.617024 -1.441208 -0.879326
H  6.62008 -1.426702 0.896873
H  -0.457148 -2.011304 0.003756
H  1.746218 -1.48439 0.001278
H  0.789613 2.13514 -0.000658
H  -1.632511 2.859751 -0.003522
H  8.850335 -0.647931 -0.001617
H  8.046408 0.682201 0.881477
H  8.043263 0.667802 -0.903224
H  -5.383043 -1.64177 -0.000285
H  -6.123727 2.089401 -0.016972
H  -6.7212 0.637919 -0.887659
H  -6.712893 0.660216 0.894078
H  -2.059045 -3.258718 0.005495
H  -3.781245 -3.50493 0.004505
