program: Gaussian 09
title: 000234068
version: EM64L-G09RevD.01
frameworkgroup: C1[X(C22H24O2)]
method: RPBEPBE
basis: SDD
operation: Freq
keyword: #pfreq=noraman
keyword: PBEPBE/SDD
title: #p freq=noraman PBEPBE/SDD
converged: YES YES NO NO
title: Mulliken charges:
elementType: O O C C C C C C C C C C C C C C C C C C C C C C H H H H H H H H H H H H H H H H H H H H H H H H
charge: -0.265992 -0.265758 -0.299580 -0.298653 -0.509609 -0.512791 -0.512952 -0.510456 0.186337 0.187492 0.288581 0.289888 -0.374700 -0.374532 -0.427587 -0.427575 -0.361767 -0.362795 -0.370160 -0.370525 0.307299 0.306979 -0.537524 -0.537575 0.250595 0.250100 0.253574 0.225897 0.241122 0.237329 0.240940 0.237379 0.253328 0.225849 0.254665 0.255168 0.247872 0.247555 0.247111 0.247089 0.236615 0.236380 0.219917 0.218906 0.243900 0.243842 0.219929 0.218893
chargesum: 0.00000
title: Mulliken charges with hydrogens summed into heavy atoms:
elementType: O O C C C C C C C C C C C C C C C C C C C C C C
charge: -0.265992 -0.265758 -0.048985 -0.048553 -0.030138 -0.034339 -0.034633 -0.031279 0.186337 0.187492 0.288581 0.289888 -0.120035 -0.119365 -0.179715 -0.180020 -0.114657 -0.115706 -0.133545 -0.134145 0.307299 0.306979 0.145199 0.145089
polarizability: 3.14511950e+02 -2.51939043e-01 2.91181405e+02 2.14761093e+01 2.26822722e-01 1.76025105e+02
1716.lowfreq: -13.4214 -10.7282 -0.0007 -0.0005 0.0010 1.6479 24.0812 31.3309 33.2543
frequency: 23.8688 30.9560 33.2364 45.4278 57.0976 74.5077 75.4333 86.2202 95.6808 112.9796 150.3293 154.2590 169.6396 179.5870 191.8837 209.8331 219.5784 240.4173 241.3087 299.3439 307.0492 340.0585 358.2960 362.3498 398.9281 415.6251 418.3480 424.1253 486.8131 489.1938 506.2390 533.8389 552.8479 584.6959 593.2963 624.3572 630.4446 683.3638 718.2362 738.0309 744.9902 760.2768 782.6132 788.0872 797.5248 809.0938 812.4261 812.6298 819.0748 835.5436 835.9894 846.9165 851.2590 884.1263 936.5801 940.0592 941.5725 962.3299 966.2868 966.5873 987.5238 988.7737 999.7217 1003.0999 1014.6814 1036.2213 1038.8388 1071.6343 1074.2722 1101.8711 1102.9298 1106.7027 1107.4945 1111.4086 1111.5497 1115.8573 1133.6452 1155.1561 1155.3630 1170.5552 1171.7793 1174.7163 1176.4724 1190.4683 1214.7576 1225.8783 1227.6968 1273.6830 1295.8378 1296.9495 1321.1295 1348.0537 1350.2167 1354.1414 1366.1961 1414.9845 1416.6350 1434.4921 1434.7110 1439.2502 1439.6574 1464.4221 1464.6747 1465.0953 1465.2830 1472.1755 1472.5487 1493.3000 1496.3586 1562.5394 1567.5768 1581.4099 1614.6446 1616.0444 2955.4149 2955.7116 3041.7617 3042.0688 3088.7115 3089.0276 3092.8117 3095.2295 3101.5593 3104.3264 3122.1709 3122.3142 3130.5557 3130.8328 3142.3411 3142.4670 3156.3882 3158.2016 3167.4576 3167.7300 3188.9535 3189.2812 3207.3850 3207.8066
redmass: 4.7865 2.9686 4.2162 3.5075 3.5526 3.0010 3.1926 3.8843 3.3900 3.8788 3.5796 3.5350 3.4101 2.8511 3.8204 3.0678 2.1656 1.3472 1.5726 4.3190 3.6606 3.9453 3.5356 4.7368 4.1741 3.0066 3.0248 4.7840 3.4600 3.0098 4.3521 2.6585 5.1917 2.5592 4.4970 6.7505 6.7743 4.2950 3.7571 4.0686 4.2769 2.9413 1.4833 1.4452 1.9133 2.2282 1.3161 1.3128 1.9952 1.6130 1.6543 2.0704 2.2589 2.4077 3.1504 1.3549 1.3791 2.4223 1.3949 1.4898 8.3879 8.3650 2.7956 2.4457 1.9468 1.2053 1.2130 1.2577 1.2847 1.3212 1.1622 1.3798 1.3528 1.2610 1.2610 1.4429 2.2897 1.3406 1.3400 1.3891 1.2800 1.2630 1.4154 2.8447 1.9568 2.8835 2.9417 1.9918 1.2798 1.2987 3.1031 2.7017 2.0496 4.4817 3.3698 3.8316 4.1520 1.1727 1.1741 1.0903 1.0893 1.2610 1.2556 1.0517 1.0509 1.0768 1.0729 2.4547 2.5059 7.8492 7.2828 9.1220 6.3539 6.3755 1.0331 1.0331 1.1038 1.1038 1.0522 1.0515 1.0771 1.0685 1.0725 1.0800 1.0988 1.0989 1.0880 1.0881 1.0880 1.0880 1.0949 1.0946 1.0966 1.0967 1.1170 1.1170 1.1148 1.1147
irintensity: 0.3888 0.6319 0.0736 2.7479 0.0078 0.4233 1.2548 0.4239 0.5418 7.0780 2.0685 0.3751 2.7491 0.0638 0.1651 1.8038 0.4323 0.1424 1.5900 5.1843 1.1072 3.6546 0.9908 0.9798 0.2050 0.4856 0.1417 1.9187 0.6196 9.6859 3.3125 15.4345 8.7048 18.7743 25.7756 0.4881 0.7114 0.0023 0.3738 1.4301 0.0506 14.5992 12.3737 0.1627 2.6340 20.2896 12.0102 19.1373 1.4713 17.0081 79.8533 1.8573 43.9490 1.5696 17.6796 1.8122 6.0697 29.0359 2.4634 5.8946 72.2334 12.0934 2.9087 1.4022 14.1749 2.6220 39.9874 8.9464 9.1398 0.2372 0.5183 18.6145 2.7464 0.2370 0.2148 7.3337 3.4819 0.0790 0.1717 2.7127 110.0668 70.7334 0.2147 0.0899 1.6255 196.2385 192.8832 46.9505 0.1606 2.6701 4.6638 18.6101 0.4702 0.0622 8.4087 6.9630 8.6379 11.8700 8.2413 10.5623 0.7493 2.6961 0.9435 14.3515 11.3087 60.6673 63.4160 106.2418 117.5739 1.0606 3.4254 28.1844 74.8839 55.1087 126.2034 42.4795 51.5191 46.1098 10.0750 25.8394 12.6691 0.2708 20.6897 28.6125 26.3335 37.5610 7.2255 10.3641 4.5142 12.0038 20.2850 18.4979 3.7608 5.2735 0.1352 0.9107 11.0921 45.6425
temp: 298.150 k
press: 1.00000 atm
elementType: 8 8 6 6 6 6 6 6 6 6 6 6 6 6 6 6 6 6 6 6 6 6 6 6 1 1 1 1 1 1 1 1 1 1 1 1 1 1 1 1 1 1 1 1 1 1 1 1
symmnumber: 1
zpe: 1038617.5 jmol-1
zpe.correction: 0.395589 hartree
zpe.thermalcorrener: 0.418919 hartree
zpe.thermalcorrenthalpy: 0.419864 hartree
zpe.thermalcorrgfe: 0.341248 hartree
zpe.sumelectzpe: -1001.334599 hartree
zpe.sumelectthermal: -1001.311268 hartree
zpe.sumelectthermalent: -1001.310324 hartree
zpe.sumelectthermalfe: -1001.388939 hartree
dipole: 0.0143 0.4379 -0.0242
dipole: 0.4388
quadrupole: -120.1132 -133.4212 -139.0335
quadrupole: 0.0841 17.5628 0.1295
quadrupole: 10.7427 -2.5652 -8.1775 0.0841 17.5628 0.1295
hfenergy: -1001.7301875 hartree
pointgroup: C01 [X(C22H24O2)]
dipole: 0.171432 -0.0181613 0.0089034 debye
polarizability: 291.4770461|2.3469392|309.5112649|-4.9677849|-32.6499533|180.7301489 unknown
InChI: InChI=1S/C22H24O2/c1-23-19-11-7-17(8-12-19)21(15-3-4-15)22(16-5-6-16)18-9-13-20(24-2)14-10-18/h7-16H,3-6H2,1-2H3
charge 0 multiplicity 1
48 atoms
O  -3.729109 -3.301904 -0.101487
O  -2.635705 4.2287 0.100881
C  2.71826 -1.796677 0.232587
C  3.11763 0.951657 -0.242023
C  2.684534 -3.326829 0.121147
C  3.342931 -2.518412 -0.997672
C  3.923873 1.440784 0.996915
C  3.52468 2.424945 -0.10366
C  1.504229 -0.913211 0.0714
C  1.701504 0.449888 -0.086684
C  0.150616 -1.548607 0.054874
C  0.584241 1.443317 -0.069999
C  -0.783485 -1.269224 -0.985555
C  -0.401442 1.425524 0.96039
C  -0.247477 -2.467022 1.061564
C  0.473678 2.452922 -1.061768
C  -2.054562 -1.865161 -1.011228
C  -1.450023 2.358452 0.99106
C  -1.526121 -3.068872 1.059424
C  -0.580074 3.394846 -1.054207
C  -2.435356 -2.76527 0.015978
C  -1.548213 3.3468 -0.020782
C  -4.170756 -4.230507 0.940044
C  -2.783547 5.261281 -0.925595
H  3.46793 -1.394926 0.926066
H  3.719675 0.364275 -0.94698
H  1.727648 -3.805592 -0.102097
H  3.32935 -3.898216 0.796308
H  4.433476 -2.528933 -1.089787
H  2.803028 -2.439854 -1.946348
H  4.971801 1.136906 1.083189
H  3.384068 1.502227 1.94694
H  2.746401 3.154843 0.133536
H  4.306603 2.799107 -0.772018
H  -0.498633 -0.57222 -1.780391
H  -0.33599 0.664476 1.744756
H  0.449848 -2.703546 1.873324
H  1.217287 2.493683 -1.865774
H  -2.76896 -1.650732 -1.811971
H  -2.203373 2.343931 1.784641
H  -1.796188 -3.760557 1.863203
H  -0.633005 4.147476 -1.847106
H  -4.184071 -3.744233 1.93536
H  -3.527161 -5.131495 0.9780
H  -5.193488 -4.518003 0.654731
H  -3.683973 5.824859 -0.639824
H  -2.926115 4.815185 -1.929536
H  -1.908966 5.941118 -0.944428
