program: Gaussian 09
title: 000234061
version: EM64L-G09RevD.01
frameworkgroup: C1[X(C16H22ClN3O)]
method: RPBEPBE
basis: SDD
operation: Freq
keyword: #p
keyword: freq=noraman
keyword: PBEPBE/SDD
title: #p freq=noraman PBEPBE/SDD
converged: YES YES NO NO
title: Mulliken charges:
elementType: Cl O N N N C C C C C C C C C C C C C C C C H H H H H H H H H H H H H H H H H H H H H H
charge: -0.065847 -0.271409 -0.073954 -0.165641 -0.014908 -0.363998 -0.359581 -0.404629 -0.426438 -0.329178 -0.420367 0.532231 -0.258399 -0.298552 -0.338755 -0.222057 -0.242489 -0.246605 -0.221540 -0.445348 -0.150573 0.198035 0.207764 0.209827 0.189174 0.231800 0.214000 0.202255 0.227904 0.173151 0.201306 0.220461 0.230506 0.190073 0.188561 0.248414 0.251719 0.226592 0.233474 0.206418 0.205979 0.265717 0.264908
chargesum: 0.00000
title: Mulliken charges with hydrogens summed into heavy atoms:
elementType: Cl O N N N C C C C C C C C C C C C C C C C
charge: -0.065847 -0.271409 -0.073954 -0.165641 -0.014908 0.041801 0.039420 0.041172 0.003721 0.045279 0.030600 0.532231 0.120235 -0.298552 -0.090340 0.029662 -0.015897 -0.013131 0.190857 0.085276 -0.150573
polarizability: 3.03496256e+02 1.81249421e+01 1.94472092e+02 -3.09691972e+00 3.83572365e+00 1.25367239e+02
1716.lowfreq: -16.8588 -2.9185 -0.0017 -0.0016 0.0014 7.3427 14.0984 24.1063 28.2873
frequency: 9.7292 23.8385 27.8585 38.7685 59.2106 65.6106 79.7105 85.5950 101.7277 114.6400 135.2191 152.2405 169.4359 177.3959 208.7887 230.2179 258.8103 283.1056 298.3649 322.1234 333.9784 373.9875 376.4505 401.3709 431.0011 446.1349 458.7089 473.9735 492.5163 545.1255 548.3855 555.1408 623.2666 658.7189 711.2064 732.7658 751.8588 769.1231 772.5913 797.5903 840.3668 851.3963 875.2769 902.6382 924.5405 927.6307 950.9665 960.0069 969.7959 1003.8031 1011.8487 1041.5224 1044.9186 1051.6491 1059.1911 1064.1656 1067.0709 1070.5371 1086.8846 1091.9281 1117.8879 1122.3466 1138.9009 1151.4267 1167.2918 1172.5768 1184.2046 1197.9869 1206.7825 1235.7950 1251.5921 1264.4479 1267.9987 1275.0984 1281.0151 1287.0068 1291.0338 1304.9818 1339.9574 1344.3941 1353.2752 1358.5912 1366.0753 1374.3637 1379.4227 1397.8743 1408.1953 1428.2335 1450.2018 1453.8493 1457.3283 1461.9380 1466.8180 1471.5641 1476.4967 1480.8907 1487.5352 1495.9158 1559.7571 1606.4902 2202.6655 2828.5563 2857.0707 2875.8900 2902.2424 2915.1240 2922.2166 2939.8984 2964.3797 2991.7292 2999.2018 3009.4514 3013.2052 3031.5136 3050.3054 3054.6385 3073.7068 3075.9066 3098.5195 3132.5946 3150.2403 3159.7333 3174.4951
redmass: 6.5019 6.7709 2.4491 4.6216 4.6090 3.6065 2.5758 3.9929 3.9869 3.0227 3.6827 5.5457 4.7491 3.3448 3.9819 5.4826 2.4989 4.7940 2.9223 2.4552 4.5103 3.6352 4.9607 2.2794 4.7101 3.3667 3.8838 3.3888 4.0483 4.2724 5.0381 3.7776 2.9591 3.9806 3.6104 4.0692 1.3518 2.7148 1.1975 1.1760 1.4212 1.5236 1.2343 6.9885 3.8813 1.3895 2.3607 3.8418 1.3223 3.2096 4.8376 2.3521 3.6789 2.0626 1.5962 2.2498 4.9431 2.2299 2.0829 3.1990 1.9592 1.9987 2.4407 2.8752 1.3750 1.1525 1.3134 1.2079 1.4522 1.4973 1.2714 1.1368 1.2169 1.3863 1.2616 1.2422 1.3105 1.4058 1.3042 1.4952 1.4196 1.6430 2.4358 1.6563 1.5311 1.4461 1.4509 2.4591 1.0782 1.0811 1.0962 1.1579 1.1219 1.0838 1.0949 2.4038 1.0913 1.0824 5.9518 6.8643 12.4329 1.0709 1.0707 1.0691 1.0686 1.0548 1.0710 1.0549 1.1062 1.1077 1.0834 1.0630 1.0585 1.0900 1.0905 1.0893 1.1020 1.1036 1.0902 1.0856 1.0892 1.0944 1.1004
irintensity: 0.8220 1.1203 0.1261 1.5217 2.3955 0.6989 3.8063 2.1616 1.8156 1.2720 13.0354 1.8606 2.6137 0.7765 6.1477 2.2025 2.7389 1.5703 0.2332 10.4667 2.6678 0.8892 0.9140 0.6094 9.4882 9.3571 9.4538 1.8533 5.2695 4.1222 1.4556 1.2414 1.1634 22.3290 3.3639 7.6830 83.5430 6.1978 9.3554 3.1958 0.6479 1.1783 0.7481 9.6778 27.4226 2.3668 12.4303 6.1264 0.4376 69.5995 69.7594 6.0454 38.9475 26.9301 0.4436 2.9805 156.4154 0.8909 7.0638 10.6209 16.1555 9.1913 35.3573 33.3551 0.6269 0.8056 3.3616 0.4673 6.5998 97.7011 20.9614 0.0721 1.3660 17.6169 0.7042 9.5872 3.5025 26.2280 4.1089 5.8541 52.3994 6.4439 13.6097 5.4062 64.9950 7.8191 2.7260 11.6048 13.0384 3.4989 10.9614 86.9672 12.0126 1.2363 7.5752 99.4811 2.7866 7.3136 2.4009 78.9649 14.7291 76.5026 65.8976 79.3925 70.8566 48.0512 96.9291 67.6644 52.1201 42.3717 12.8904 29.7735 5.9968 50.9976 42.8127 24.9201 6.6861 44.5619 6.4795 6.0015 8.9750 16.8517 14.9210
temp: 298.150 k
press: 1.00000 atm
elementType: 17 8 7 7 7 6 6 6 6 6 6 6 6 6 6 6 6 6 6 6 6 1 1 1 1 1 1 1 1 1 1 1 1 1 1 1 1 1 1 1 1 1 1
symmnumber: 1
zpe: 932209.5 jmol-1
zpe.correction: 0.355060 hartree
zpe.thermalcorrener: 0.376623 hartree
zpe.thermalcorrenthalpy: 0.377568 hartree
zpe.thermalcorrgfe: 0.300263 hartree
zpe.sumelectzpe: -1320.783011 hartree
zpe.sumelectthermal: -1320.761448 hartree
zpe.sumelectthermalent: -1320.760503 hartree
zpe.sumelectthermalfe: -1320.837808 hartree
dipole: 3.0493 0.6594 0.4622
dipole: 3.1538
quadrupole: -195.2464 -125.2847 -134.6437
quadrupole: 9.3200 -0.0942 -2.1293
quadrupole: -43.5215 26.4402 17.0813 9.3200 -0.0942 -2.1293
hfenergy: -1321.138071 hartree
pointgroup: C01 [X(C16H22Cl1N3O1)]
dipole: 1.2040896 0.1447514 0.2623741 debye
polarizability: 303.4410238|18.7498643|174.8296446|2.9171355|31.1939642|145.0649189 unknown
InChI: InChI=1S/C16H22ClN3O/c17-15-5-1-2-6-16(15)20-11-9-19(10-12-20)8-4-14-21-13-3-7-18/h1-2,5-6H,3-4,8-14H2
charge 0 multiplicity 1
43 atoms
Cl 4.60719 -1.85424 -1.603462
O  -5.102555 -0.105077 0.256022
N  -0.224964 -0.907677 0.182956
N  2.576218 -0.170178 0.115651
N  -9.961473 -0.026604 0.07547
C  0.826917 -1.908669 -0.137335
C  0.210445 0.440766 -0.256904
C  2.151186 -1.530435 0.540725
C  1.537456 0.836906 0.416808
C  -1.542796 -1.304849 -0.371221
C  -2.709136 -0.458746 0.181965
C  3.937785 0.199661 0.242745
C  -4.066633 -1.017186 -0.254787
C  4.988622 -0.488072 -0.437686
C  4.338196 1.324525 1.028816
C  6.34005 -0.122235 -0.31867
C  5.687006 1.719106 1.136553
C  6.700644 0.990718 0.475752
C  -6.454917 -0.542427 -0.082982
C  -7.393792 0.514949 0.535761
C  -8.813093 0.221028 0.284494
H  0.999723 -1.990396 -1.239781
H  0.497311 -2.896359 0.235823
H  -0.557369 1.182504 0.02462
H  0.344295 0.482204 -1.368383
H  2.926355 -2.264308 0.275131
H  2.010171 -1.549783 1.64582
H  1.362777 0.934231 1.514486
H  1.860199 1.817441 0.024604
H  -1.548253 -1.261218 -1.493074
H  -1.706311 -2.365121 -0.09261
H  -2.644339 0.588468 -0.166662
H  -2.653323 -0.444241 1.285389
H  -4.229304 -2.038271 0.157953
H  -4.135336 -1.078532 -1.364762
H  3.57321 1.879268 1.580615
H  7.09934 -0.687336 -0.867712
H  5.946239 2.586836 1.753147
H  7.751959 1.282647 0.560578
H  -6.664942 -1.547903 0.341295
H  -6.592333 -0.591239 -1.184764
H  -7.211372 0.562812 1.625084
H  -7.140753 1.507534 0.119931
