program: Gaussian 09
title: 000234052
version: EM64L-G09RevD.01
frameworkgroup: C1[X(C14H22N2O)]
method: RPBEPBE
basis: SDD
operation: Freq
keyword: #p
keyword: freq=noraman
keyword: PBEPBE/SDD
title: #p freq=noraman PBEPBE/SDD
converged: YES YES NO NO
title: Mulliken charges:
elementType: O N N C C C C C C C C C C C C C C H H H H H H H H H H H H H H H H H H H H H H
charge: -0.435429 -0.074354 -0.181165 -0.347983 -0.375336 -0.392809 -0.400238 -0.320499 0.478519 -0.420161 -0.534420 -0.321923 -0.400353 0.471127 -0.217985 -0.451214 -0.819966 0.185385 0.209460 0.209130 0.186914 0.207136 0.214004 0.207462 0.215412 0.177972 0.200111 0.203893 0.225452 0.232533 0.182370 0.213946 0.217902 0.216578 0.230015 0.231955 0.222532 0.222350 0.331677
chargesum: 0.00000
title: Mulliken charges with hydrogens summed into heavy atoms:
elementType: O N N C C C C C C C C C C C C C C
charge: -0.103751 -0.074354 -0.181165 0.046862 0.020708 0.028331 0.022637 0.057584 0.478519 0.009183 -0.301887 0.074393 -0.182451 0.471127 -0.001408 -0.221199 -0.143129
polarizability: 2.49410311e+02 -2.77279172e-01 1.61262482e+02 1.51774634e+00 4.22285042e+00 1.10854600e+02
1716.lowfreq: -3.7001 -0.0006 -0.0002 0.0006 5.9676 14.2036 23.3469 31.1587 45.6871
frequency: 23.3181 31.1466 45.5185 52.9008 61.6442 74.9485 111.9248 134.1666 176.5170 198.5264 206.1667 231.2218 238.9410 275.1094 302.1908 322.3573 331.7148 365.9986 390.4559 441.2760 454.6169 463.2301 492.7373 522.3556 539.9099 571.2054 629.4317 694.0611 698.3745 765.3245 775.8512 780.2276 829.3537 845.6336 852.7574 871.0519 873.0480 948.5197 953.1787 957.4768 964.6404 983.6780 1004.1777 1012.8053 1044.9852 1047.4368 1051.9127 1061.0677 1067.6875 1084.1955 1097.0178 1099.5028 1135.9895 1151.3757 1166.2565 1182.4428 1192.7380 1204.3403 1210.7206 1250.3793 1259.7878 1278.4647 1282.0438 1291.7930 1304.2526 1315.9377 1333.8286 1345.0324 1347.4115 1358.1921 1371.8968 1374.8129 1383.9117 1387.3271 1394.2379 1398.8449 1435.4315 1453.5776 1456.6817 1460.5706 1465.9695 1467.9747 1472.7746 1475.5766 1476.2151 1488.6458 1494.2600 1590.5448 1616.6371 2835.5123 2849.2502 2861.5323 2905.6235 2918.3663 2947.4540 2972.3346 2984.1249 2994.5444 3028.1164 3046.6507 3052.3493 3053.3773 3053.9314 3074.0861 3082.3851 3091.9612 3119.6851 3139.9240 3142.5208 3159.5795 3559.5200
redmass: 5.0012 1.0321 2.2468 4.0054 2.2758 4.2678 3.7464 3.0579 2.9826 4.1045 3.0939 2.3206 2.5555 2.7332 2.4292 2.2259 1.3979 4.5019 1.9515 2.8369 3.3255 2.9985 3.2008 4.6255 4.8939 3.3516 2.4928 2.1319 3.3850 3.0402 1.1079 1.7012 3.3469 1.6696 1.4044 1.3539 1.3179 2.4980 2.2022 4.1758 1.3600 4.4535 2.0106 2.1514 1.5550 2.5113 2.3627 2.2761 1.9437 2.0246 1.7803 1.6624 2.3035 2.6279 1.9482 1.2991 1.4428 1.8007 1.3389 1.5545 1.3488 1.2719 1.2548 1.2245 1.3719 1.2986 1.2728 1.3395 1.4213 1.9670 1.4814 1.6221 1.2710 3.2951 1.2372 1.4217 2.5440 1.0806 1.0947 1.0969 1.1005 1.0752 1.0838 1.2410 1.0999 1.0943 2.2560 5.7493 6.0243 1.0705 1.0712 1.0692 1.0691 1.0711 1.0692 1.0382 1.0609 1.0870 1.0892 1.0948 1.0956 1.0897 1.0898 1.0998 1.0992 1.0889 1.0856 1.0917 1.0903 1.0970 1.0661
irintensity: 0.2623 0.2294 1.4287 0.3854 5.0104 2.3267 2.4300 2.1750 3.9582 0.0498 4.9476 3.7619 2.6292 5.2023 12.5060 25.8023 136.4385 13.6782 1.1505 4.2816 5.7759 1.8482 9.1469 1.7096 0.1908 1.4535 5.8765 17.2539 11.9112 20.9003 9.8709 33.7747 3.5377 1.8467 12.2512 3.4954 3.9648 6.2043 4.3210 149.8995 1.0424 23.0428 38.2568 5.5646 16.6267 1.5949 10.9588 12.2181 7.8652 5.9446 30.0593 5.1665 38.3315 25.1022 30.6124 5.9791 18.3682 30.2174 0.3745 127.2417 24.6317 0.9437 6.2380 16.5321 28.2473 1.5540 13.9655 1.4361 3.6901 31.3469 1.1672 32.9997 31.8726 25.6309 11.1313 1.1839 17.8667 2.1300 13.6313 32.4466 16.1066 1.6484 12.2210 10.6826 1.8333 10.0080 107.5267 27.3850 212.1949 55.0136 51.2842 145.8246 62.8357 103.7833 63.8143 41.5297 25.4479 25.8561 46.5888 25.2202 21.5567 70.8995 0.4230 56.5406 22.3930 19.7658 5.2335 43.6533 12.8684 19.2249 7.7676
temp: 298.150 k
press: 1.00000 atm
elementType: 8 7 7 6 6 6 6 6 6 6 6 6 6 6 6 6 6 1 1 1 1 1 1 1 1 1 1 1 1 1 1 1 1 1 1 1 1 1 1
symmnumber: 1
zpe: 886452.0 jmol-1
zpe.correction: 0.337632 hartree
zpe.thermalcorrener: 0.355342 hartree
zpe.thermalcorrenthalpy: 0.356286 hartree
zpe.thermalcorrgfe: 0.290008 hartree
zpe.sumelectzpe: -730.063340 hartree
zpe.sumelectthermal: -730.045630 hartree
zpe.sumelectthermalent: -730.044686 hartree
zpe.sumelectthermalfe: -730.110964 hartree
dipole: -0.0530 -1.5905 -0.4836
dipole: 1.6633
quadrupole: -122.0482 -96.8985 -104.5310
quadrupole: -4.9853 -3.4490 0.0359
quadrupole: -14.2223 10.9274 3.2949 -4.9853 -3.4490 0.0359
hfenergy: -730.400972 hartree
pointgroup: C01 [X(C14H22N2O1)]
dipole: 0.0236032 -0.5888507 0.2844455 debye
polarizability: 249.4183396|0.6704244|158.7766507|0.8422172|-11.7084445|113.3324022 unknown
InChI: InChI=1S/C14H22N2O/c1-13-4-2-5-14(12-13)16-9-7-15(8-10-16)6-3-11-17/h2,4-5,12,17H,3,6-11H2,1H3
charge 0 multiplicity 1
39 atoms
O  -7.116311 0.591933 0.466366
N  -2.228737 -0.491069 -0.008624
N  0.625553 0.017901 -0.206975
C  -1.718929 0.841902 -0.414166
C  -1.287617 -1.537738 -0.476652
C  -0.324467 1.084583 0.185441
C  0.119332 -1.329853 0.112392
C  -3.614511 -0.756123 -0.469101
C  2.022167 0.271051 -0.178647
C  -4.664833 0.148701 0.208828
C  2.956027 -0.725952 0.232848
C  -6.101888 -0.316873 -0.091534
C  2.542591 1.532765 -0.603102
C  4.354251 -0.499105 0.207457
C  3.930024 1.764179 -0.614493
C  4.843466 0.760021 -0.215941
C  5.31086 -1.603974 0.628571
H  -1.662302 0.931305 -1.529905
H  -2.402307 1.62434 -0.040608
H  -1.666461 -2.52596 -0.154645
H  -1.20869 -1.545036 -1.594475
H  0.047002 2.063177 -0.154367
H  -0.418722 1.123147 1.295275
H  0.083359 -1.501162 1.213923
H  0.790747 -2.084414 -0.332642
H  -3.705837 -0.658022 -1.583291
H  -3.842904 -1.813028 -0.223242
H  -4.481886 0.1349 1.302534
H  -4.570319 1.197155 -0.130004
H  2.599596 -1.692231 0.604756
H  -6.255345 -1.354445 0.279091
H  -6.29942 -0.305751 -1.1774
H  1.869716 2.322081 -0.952547
H  4.304809 2.738739 -0.94932
H  5.922039 0.953457 -0.231465
H  5.473932 -2.325907 -0.195481
H  6.29741 -1.196535 0.910543
H  4.918464 -2.174534 1.489955
H  -6.993259 0.640675 1.448252
