program: Gaussian 09
title: 000234050
version: EM64L-G09RevD.01
frameworkgroup: C1[X(C13H19ClN2O)]
method: RPBEPBE
basis: SDD
operation: Freq
keyword: #p
keyword: freq=noraman
keyword: PBEPBE/SDD
title: #p freq=noraman PBEPBE/SDD
converged: YES YES NO NO
title: Mulliken charges:
elementType: Cl O N N C C C C C C C C C C C C C H H H H H H H H H H H H H H H H H H H
charge: -0.079222 -0.434665 -0.075760 -0.174731 -0.347125 -0.374512 -0.392823 -0.401427 -0.321520 -0.419048 0.483779 -0.321894 -0.365508 -0.361192 -0.221948 -0.221756 -0.118261 0.186516 0.212064 0.212104 0.188176 0.205999 0.218913 0.213054 0.214975 0.179644 0.200994 0.204570 0.224984 0.182891 0.214303 0.222657 0.237147 0.248599 0.247865 0.332157
chargesum: 0.00000
title: Mulliken charges with hydrogens summed into heavy atoms:
elementType: Cl O N N C C C C C C C C C C C C C
charge: -0.079222 -0.102507 -0.075760 -0.174731 0.051455 0.025768 0.032089 0.026602 0.059118 0.010506 0.483779 0.075300 -0.142851 -0.124046 0.026651 0.026110 -0.118261
polarizability: 2.68822602e+02 -3.68273701e+00 1.47383468e+02 -7.93248146e-01 -6.90915797e+00 1.03836838e+02
1716.lowfreq: -9.2394 -0.0015 -0.0009 0.0018 2.0983 5.9321 18.7978 33.6908 42.7090
frequency: 18.6750 32.5827 42.5109 54.0748 67.9072 88.2213 127.6350 142.8993 188.2501 196.0563 217.8280 258.5848 271.1052 295.4535 318.3517 329.8811 335.1423 389.5989 411.4649 432.0390 447.2548 463.1034 493.7463 509.5880 566.8917 625.6579 644.1192 694.8051 732.2747 768.1578 772.2927 797.1392 807.9116 845.9531 869.8341 918.0713 925.3832 941.9013 954.5362 957.6691 982.7707 1007.2732 1045.5281 1050.7980 1060.3383 1066.2592 1080.3395 1083.8911 1095.7947 1119.2758 1136.1227 1151.4436 1164.9073 1194.5517 1197.3065 1209.6562 1238.3720 1258.3685 1276.5977 1278.9586 1287.9059 1300.6114 1304.3179 1333.0136 1343.3847 1345.2951 1360.6058 1366.3621 1373.4958 1381.0843 1383.1149 1399.8764 1414.1043 1453.6442 1457.1157 1461.7387 1467.2404 1467.4686 1476.0981 1488.4213 1491.8805 1571.4116 1610.3873 2837.5927 2851.2991 2863.1079 2913.3517 2925.6502 2947.3550 2983.4110 2997.1895 3030.6044 3044.7329 3054.2361 3054.7539 3073.4174 3089.8410 3147.1518 3153.9619 3168.6957 3175.6637 3559.4751
redmass: 4.8752 1.8944 6.2451 2.9875 5.3951 4.9477 2.9346 6.0490 5.3277 3.0113 2.7407 2.6004 2.6123 3.3590 2.6084 1.7450 3.3745 2.0328 2.9859 4.4836 4.9991 3.0214 3.0172 2.8002 3.6344 6.9467 2.6819 3.1475 4.7898 3.0704 1.1165 1.3107 1.7790 1.5720 1.2189 3.6419 1.3699 1.3647 2.2119 4.5481 4.0937 2.5302 2.3189 2.6849 2.1727 2.0936 2.5361 2.1160 1.8071 1.4254 2.3187 2.4621 1.9824 1.5630 1.1946 1.4266 1.4444 1.3287 1.2835 1.2336 1.2157 1.3586 1.3263 1.2985 1.4754 1.3805 1.8620 2.0495 1.6199 1.7872 1.2658 1.4206 3.7093 1.0809 1.0909 1.0966 1.1012 1.0771 1.0957 1.0953 2.5072 7.2913 6.2220 1.0706 1.0713 1.0693 1.0687 1.0708 1.0691 1.0604 1.0871 1.0893 1.0964 1.0899 1.0899 1.0995 1.0894 1.0873 1.0877 1.0963 1.0961 1.0662
irintensity: 0.7711 3.8769 1.5551 2.5048 1.2061 1.1792 3.2975 0.0216 0.2481 9.2174 0.7109 2.8033 2.9378 9.7722 28.8264 131.5388 25.3100 1.4047 0.9734 8.1750 1.2295 3.6396 14.4145 23.8531 4.5555 0.3672 34.3674 3.1065 11.0809 6.2186 9.9257 1.0556 74.0661 2.4565 4.2649 18.0205 0.4934 1.6460 2.1688 147.2844 21.0096 17.5391 4.9850 19.3910 17.4795 0.9737 23.3217 4.1297 31.7748 5.2326 41.5730 25.1878 29.1301 9.8744 2.2987 5.1454 218.5379 28.9656 2.7224 4.1564 13.4970 13.5870 18.9038 13.8986 3.0435 4.0436 18.1969 9.8274 15.3072 33.4951 34.5019 1.1069 0.5853 4.3953 13.6298 47.7167 30.2443 2.0837 1.4912 11.3616 248.9331 2.3609 88.6028 53.3031 48.1426 151.9707 61.0661 95.2205 63.7161 24.9114 23.9994 43.8208 28.0835 66.0305 0.6437 54.9308 19.8823 11.5943 8.4259 15.0206 5.1713 7.9896
temp: 298.150 k
press: 1.00000 atm
elementType: 17 8 7 7 6 6 6 6 6 6 6 6 6 6 6 6 6 1 1 1 1 1 1 1 1 1 1 1 1 1 1 1 1 1 1 1
symmnumber: 1
zpe: 789913.2 jmol-1
zpe.correction: 0.300862 hartree
zpe.thermalcorrener: 0.318096 hartree
zpe.thermalcorrenthalpy: 0.319041 hartree
zpe.thermalcorrgfe: 0.253432 hartree
zpe.sumelectzpe: -1150.224992 hartree
zpe.sumelectthermal: -1150.207758 hartree
zpe.sumelectthermalent: -1150.206813 hartree
zpe.sumelectthermalfe: -1150.272422 hartree
dipole: -3.0123 1.4534 -0.5626
dipole: 3.3915
quadrupole: -149.4128 -101.2863 -109.6456
quadrupole: -7.3231 4.9481 -0.8385
quadrupole: -29.2979 18.8286 10.4693 -7.3231 4.9481 -0.8385
hfenergy: -1150.525854 hartree
pointgroup: C01 [X(C13H19Cl1N2O1)]
dipole: -1.1825883 -0.5630826 0.2546491 debye
polarizability: 268.6115235|5.6645422|145.6941233|3.7369791|-11.0005215|105.7372618 unknown
InChI: InChI=1S/C13H19ClN2O/c14-12-2-4-13(5-3-12)16-9-7-15(8-10-16)6-1-11-17/h2-5,17H,1,6-11H2
charge 0 multiplicity 1
36 atoms
Cl 6.608122 0.441008 0.160345
O  -7.152877 0.953638 0.23759
N  -2.337537 -0.48008 0.030145
N  0.551092 -0.178466 -0.031373
C  -1.714745 0.79186 -0.411571
C  -1.453753 -1.610862 -0.342545
C  -0.340233 0.971349 0.251563
C  -0.066364 -1.47492 0.309668
C  -3.718148 -0.669559 -0.48076
C  -4.72966 0.33415 0.111612
C  1.955579 -0.026654 0.055145
C  -6.182187 -0.047849 -0.231153
C  2.593044 1.181159 -0.36998
C  2.797894 -1.081742 0.525147
C  3.993128 1.325161 -0.335869
C  4.202332 -0.945429 0.550916
C  4.789022 0.256904 0.121437
H  -1.5947 0.819159 -1.525462
H  -2.359015 1.637429 -0.114538
H  -1.916419 -2.553954 0.003296
H  -1.321961 -1.677766 -1.453222
H  0.113614 1.903143 -0.118643
H  -0.487748 1.076656 1.350499
H  -0.166208 -1.596858 1.413139
H  0.569735 -2.291486 -0.073342
H  -3.755387 -0.615552 -1.600825
H  -4.030034 -1.696207 -0.201261
H  -4.592741 0.358152 1.21177
H  -4.549758 1.357403 -0.267532
H  -6.422132 -1.053323 0.179599
H  -6.332554 -0.076804 -1.324211
H  2.001418 2.013204 -0.762283
H  2.367665 -2.014478 0.898889
H  4.457484 2.255839 -0.675616
H  4.826042 -1.766189 0.91772
H  -7.07611 1.03526 1.222005
