program: Gaussian 09
title: 000234018
version: EM64L-G09RevD.01
frameworkgroup: C1[X(C6H12OS2)]
method: RPBEPBE
basis: SDD
operation: Freq
keyword: #p
keyword: freq=noraman
keyword: PBEPBE/SDD
title: #p freq=noraman PBEPBE/SDD
converged: YES YES NO NO
title: Mulliken charges:
elementType: S S O C C C C C C H H H H H H H H H H H H
charge: 0.183365 0.062352 -0.152192 -0.336644 -0.620291 -0.669726 -0.246089 -0.360579 -0.671498 0.216847 0.216618 0.283775 0.283296 0.215817 0.223497 0.215682 0.234149 0.234267 0.211084 0.238164 0.238104
chargesum: 0.00000
title: Mulliken charges with hydrogens summed into heavy atoms:
elementType: S S O C C C C C C
charge: 0.183365 0.062352 -0.152192 0.096821 -0.053220 -0.014730 0.222328 -0.360579 0.015855
polarizability: 1.41832206e+02 4.81789798e+00 1.18078814e+02 -9.53317750e-02 9.62456210e-02 6.32263891e+01
1716.lowfreq: -4.5740 -2.5995 -0.0026 -0.0023 0.0010 6.4535 33.8661 50.3357 76.5831
frequency: 33.7353 50.1974 76.5774 82.0043 105.1500 131.6388 154.8231 228.4787 238.6982 245.5126 263.5849 342.1176 387.2317 437.3389 506.3437 545.9594 699.2220 741.7199 809.3545 815.5473 855.2075 902.7608 965.5182 1007.8968 1044.9267 1064.3088 1102.9156 1116.9959 1118.9129 1166.9349 1214.3427 1252.1142 1254.2191 1280.9689 1333.2158 1355.3166 1391.9966 1400.5134 1436.7523 1460.6023 1468.0193 1474.3795 1478.0106 1483.7894 1485.7901 2981.7192 2990.4898 2992.3395 3000.7701 3033.4827 3041.4780 3057.1971 3081.0096 3083.4200 3096.3874 3113.3784 3116.0561
redmass: 4.1916 1.6293 2.1095 4.1128 2.6429 3.9043 4.4581 1.0940 1.2008 4.6774 3.7148 4.3054 5.8421 8.5374 12.3525 7.4117 5.6823 1.0824 4.2359 1.0927 1.1817 1.9120 9.6750 2.1469 2.9481 1.1939 2.1579 2.4560 1.3950 6.5734 1.3866 1.2200 1.1599 1.0988 1.4339 1.3435 1.2000 1.2458 1.0838 1.0390 1.0749 1.0571 1.0415 1.0581 1.0758 1.0353 1.0544 1.0599 1.0380 1.0571 1.1022 1.1082 1.1016 1.0996 1.0982 1.1083 1.1022
irintensity: 0.1192 0.9714 0.3017 1.9105 5.2341 0.0055 0.2962 0.0145 0.7628 3.2050 0.1361 1.9385 2.5428 18.1180 0.0002 20.4034 10.9369 10.1658 19.8066 5.0948 0.6708 20.3456 251.7079 49.8238 1.7414 1.1612 26.8525 46.3012 6.1429 422.8047 0.0420 9.0520 0.0215 0.1260 3.5042 1.1196 12.1850 19.6887 10.9803 12.5939 12.2777 3.2424 14.0587 10.9316 14.1277 33.7354 18.7499 16.9153 20.1055 5.2364 5.0935 13.5453 44.8686 40.6704 21.9681 20.0869 32.6324
temp: 298.150 k
press: 1.00000 atm
elementType: 16 16 8 6 6 6 6 6 6 1 1 1 1 1 1 1 1 1 1 1 1
symmnumber: 1
zpe: 446203.3 jmol-1
zpe.correction: 0.169950 hartree
zpe.thermalcorrener: 0.182264 hartree
zpe.thermalcorrenthalpy: 0.183208 hartree
zpe.thermalcorrgfe: 0.129613 hartree
zpe.sumelectzpe: -1106.430017 hartree
zpe.sumelectthermal: -1106.417703 hartree
zpe.sumelectthermalent: -1106.416759 hartree
zpe.sumelectthermalfe: -1106.470354 hartree
dipole: 0.6911 -3.8789 0.0029
dipole: 3.9400
quadrupole: -57.9013 -75.7723 -70.3914
quadrupole: 6.6248 -0.0098 -0.0184
quadrupole: 10.1204 -7.7506 -2.3698 6.6248 -0.0098 -0.0184
hfenergy: -1106.5999671 hartree
pointgroup: C01 [X(C6H12O1S2)]
dipole: 0.4462775 1.1698398 -0.9138489 debye
dipolederiv: -0.6920856 -0.2184074 0.1910146 -0.4136344 -0.3189681 0.2164043 0.3389758 0.2073538 -0.226434 -0.3709723 0.1034095 -0.0701568 -0.0279323 -0.6460747 0.381287 0.0299411 0.3758975 -0.4335176 -1.5941368 0.6488539 -0.440684 0.4466162 -0.6182687 0.2877938 -0.2871246 0.2786011 -0.4189468 -0.0334146 -0.0070246 0.0149157 0.1724754 0.1184155 0.0259818 -0.1250392 0.0340695 0.1393662 0.5028495 -0.0096665 -0.0074395 -0.1337185 0.0598042 0.0603088 0.086794 0.0543779 0.0884275 -0.0871592 0.0276001 -0.0123704 -0.0748821 0.0682949 0.0250338 0.0677917 0.0201966 0.0780228 0.4862207 -0.1791979 0.1319277 -0.390738 0.5235869 -0.1057737 0.2938427 -0.1137962 0.4404297 1.7023256 -0.3579548 0.205457 0.2501247 0.9478916 -0.7958444 -0.2561081 -0.7699356 0.5099929 -0.1136263 0.038691 -0.0229816 0.051158 0.0330052 0.0137444 -0.0329324 0.014331 0.0439458 0.0521333 0.0158706 -0.0499036 -0.0117866 0.0774709 -0.0002736 0.0021867 0.0096095 -0.1572532 0.0535472 0.0387517 -0.0040853 -0.0182372 -0.1470671 -0.0464332 0.0089835 -0.0606711 0.0650944 -0.0235961 -0.0019091 -0.0005216 0.0306176 -0.0668486 -0.0392633 -0.0608115 -0.0143346 0.0565327 -0.024048 0.0027308 -0.0019886 0.0705284 0.059122 0.0148239 -0.0169316 -0.0048385 -0.0737767 0.090159 -0.020549 -0.0183582 0.0489936 -0.1491054 -0.0645754 -0.0156716 -0.068681 0.0682834 -0.170707 -0.0725972 0.0703215 -0.0890353 0.0471031 0.0520588 0.0835667 0.0511779 0.0640282 0.0897915 0.0123503 0.0073552 0.026461 0.0849972 -0.0108541 -0.0604501 -0.0025145 -0.1658974 0.0017505 -0.0779184 -0.0533999 -0.0031581 -0.0878397 -0.0035572 -0.1263844 -0.0207507 -0.00233 0.0135186 0.0317204 0.0841991 0.1205811 -0.0079911 -0.0068409 0.0316695 0.0170707 -0.0943396 0.0363482 0.0487454 -0.0339932 0.0759748 -0.0460312 0.1232274 -0.0548388 0.1242995 0.0260922 0.0365149 -0.0437181 -0.0327302 -0.1151229 -0.0415816 -0.0896691 -0.0144855 -0.0776446 0.0761052 0.0445869 0.0202192 0.0434221 -0.0152854 0.1100847 -0.0375789 0.107026 -0.0538184 -0.0838258 unknown
polarizability: 140.3256764|-7.4147542|99.1280607|2.5008722|-27.0178413|83.6836718 unknown
InChI: InChI=1S/C6H12OS2/c1-3-5-9-6(8)7-4-2/h3-5H2,1-2H3
charge 0 multiplicity 1
21 atoms
S  0.451997 0.900674 -0.090001
S  -0.533658 -1.456917 1.737226
O  -2.129953 0.261313 0.492774
C  3.256187 0.738849 -0.108373
C  2.031735 0.035217 0.501505
C  4.563347 0.054484 0.355278
C  -2.438167 1.436219 -0.392388
C  -0.833309 -0.132738 0.742121
C  -3.957415 1.555495 -0.423781
H  3.193986 0.713196 -1.21309
H  3.267509 1.804238 0.191346
H  1.951828 -1.019874 0.192165
H  2.025591 0.076078 1.603141
H  4.5905 -1.006242 0.045285
H  5.443771 0.558476 -0.081839
H  4.663899 0.088854 1.455636
H  -1.956311 2.334271 0.03835
H  -2.012133 1.239143 -1.394298
H  -4.250164 2.407657 -1.064137
H  -4.414049 0.638581 -0.831591
H  -4.357789 1.725828 0.589267
