program: Gaussian 09
title: 000234014
version: EM64L-G09RevD.01
frameworkgroup: C1[X(C5H8ClN5)]
method: RPBEPBE
basis: SDD
operation: Freq
keyword: #p
keyword: freq=noraman
keyword: PBEPBE/SDD
title: #p freq=noraman PBEPBE/SDD
converged: YES YES NO NO
title: Mulliken charges:
elementType: Cl N N N N N C C C C C H H H H H H H H
charge: -0.063141 -0.151989 -0.108335 -0.594978 -0.654398 0.054713 0.243750 0.319738 -0.623421 -0.306753 -0.383722 0.299051 0.215293 0.214621 0.301089 0.307528 0.308372 0.378946 0.243638
chargesum: 0.00000
title: Mulliken charges with hydrogens summed into heavy atoms:
elementType: Cl N N N N N C C C C C
charge: -0.063141 -0.151989 -0.108335 0.013639 0.032920 0.054713 0.243750 0.319738 0.105544 -0.306753 -0.140084
polarizability: 1.45810339e+02 1.94831729e+00 1.19173703e+02 -2.82822009e-01 7.20023117e-01 4.90355887e+01
1716.lowfreq: -24.0114 -11.2403 -4.5704 0.0012 0.0013 0.0017 3.3187 66.9753 115.3060
frequency: -23.8851 66.9677 115.3030 176.8704 202.8181 212.2306 295.2150 300.3939 345.4383 366.2330 392.7885 406.2086 470.6940 503.5720 549.4226 555.6757 587.0511 636.2252 744.8270 749.3294 798.2932 805.9723 853.6518 875.0474 982.0904 1089.8125 1116.1729 1127.0334 1163.4342 1208.1573 1244.5788 1263.3568 1323.1030 1366.3824 1395.3464 1402.1251 1430.9953 1465.6740 1486.3121 1509.6744 1529.0978 1583.0463 1676.7625 2949.5117 3027.4237 3124.1637 3182.8774 3342.2978 3382.5406 3459.9516 3628.8160
redmass: 2.4510 4.4475 2.1222 2.0363 6.6216 5.6252 3.9952 4.9955 6.1911 4.4171 1.3214 3.0877 1.1144 3.4854 5.9408 5.2958 6.1674 7.1578 6.5976 9.5380 1.3069 3.5612 1.6426 1.3854 2.0793 2.1615 1.2734 2.5619 4.7649 4.5768 2.6883 1.1975 7.7495 2.3572 1.3874 1.8784 3.7508 1.2500 1.1210 3.0865 1.3882 4.4841 1.1357 1.0392 1.0991 1.0956 1.0924 1.0444 1.0539 1.0974 1.0956
irintensity: 5.4520 1.4041 1.1318 10.1324 0.7243 3.6600 11.4057 1.8914 2.7124 2.2374 3.4962 2.8087 168.8327 7.8090 16.1828 12.3358 2.3319 19.8790 17.9531 2.6894 91.2541 52.8485 183.8264 18.8106 14.4745 183.4490 1.3944 28.3377 7.7486 13.1940 27.1147 7.5348 27.7445 1.0233 9.7575 94.6022 92.4311 74.6975 31.8844 309.6751 66.8758 158.6106 52.3529 112.5945 47.0393 0.8715 12.9409 0.5908 202.6790 1.3441 82.6582
temp: 298.150 k
press: 1.00000 atm
elementType: 17 7 7 7 7 7 6 6 6 6 6 1 1 1 1 1 1 1 1
symmnumber: 1
zpe: 373659.4 jmol-1
zpe.correction: 0.142319 hartree
zpe.thermalcorrener: 0.152391 hartree
zpe.thermalcorrenthalpy: 0.153335 hartree
zpe.thermalcorrgfe: 0.106662 hartree
zpe.sumelectzpe: -928.287949 hartree
zpe.sumelectthermal: -928.277877 hartree
zpe.sumelectthermalent: -928.276933 hartree
zpe.sumelectthermalfe: -928.323606 hartree
dipole: -6.3400 -4.0999 0.2735
dipole: 7.5552
quadrupole: -66.2074 -66.1440 -72.2915
quadrupole: 3.2492 -0.7050 -0.5521
quadrupole: 2.0069 2.0703 -4.0772 3.2492 -0.7050 -0.5521
hfenergy: -928.4302683 hartree
pointgroup: C01 [X(C5H8Cl1N5)]
dipole: -2.732934 -1.1614252 -0.1322891 debye
dipolederiv: -0.6746462 0.3683567 0.0932487 0.4428811 -0.4389383 -0.0835659 0.1150675 -0.0846284 -0.1243437 -1.2292329 0.0046301 0.0024886 -0.1242005 -0.0420485 0.0244457 -0.2653302 -0.0042559 -0.3297548 -0.6582146 0.1005564 0.0350393 -0.2539029 -0.3591743 -0.0314516 -0.0468455 -0.0465699 -0.215823 -0.3662061 0.2008007 0.0296169 0.5016006 -0.194447 -0.0885069 0.1523031 -0.0440453 0.0279427 -0.3464722 -0.1951783 -0.0585676 -0.2040583 -1.2612311 -0.1828306 -0.0519336 -0.2260256 -0.7087355 -0.5761673 -0.0115526 0.0010009 -0.0913031 -0.7096681 -0.1420948 -0.0191123 -0.1359308 -0.161156 1.867864 0.4452644 0.1083342 0.0639097 -0.0335316 -0.0140884 0.0560522 -0.0229958 0.1154453 -0.8962136 0.3681693 0.1097934 0.5266385 1.0481402 0.2585737 0.120135 0.2502824 0.2120734 0.3809988 -0.1541929 -0.0500032 -0.4390518 0.0044169 -0.007624 -0.0681549 -0.0095894 0.310748 1.2417231 -0.7557012 -0.1988438 -0.3234056 0.6916956 0.1803898 -0.0939487 0.1879102 -0.0035407 0.4159815 -0.1389785 -0.0370406 0.1089758 0.4042884 0.1197002 0.0368878 0.1231593 -0.0800291 0.2191493 -0.0749885 0.0082215 0.01708 -0.003187 -0.004924 0.0276631 -0.0106332 0.1283612 -0.1009655 0.0397617 0.08524 0.0106334 0.0612659 0.0883034 0.1993716 0.0207424 -0.122746 -0.1379206 0.0537654 -0.0923623 0.000343 0.0998853 -0.050435 -0.1582529 -0.0045177 -0.0700777 0.0810313 -0.1607153 0.0949528 -0.1305789 0.1570458 -0.0329837 0.1081973 0.0441704 0.0541189 0.0964917 -0.1083112 -0.128721 -0.0577737 0.1714987 0.0679239 -0.0856345 0.0264527 0.1292993 0.1391474 0.0127513 0.0090324 0.0032912 0.262515 -0.0220598 0.0042454 -0.0114621 0.3652024 0.4826188 0.0277633 -0.005984 -0.0213684 0.2108971 -0.0268957 -0.0205112 0.0007225 0.3406311 0.0610331 -0.022201 -0.005446 -0.0297101 -0.069423 -0.0518763 -0.0101994 -0.0527858 0.1323842 unknown
polarizability: 145.6726273|-2.3420223|115.3449373|-1.6758988|16.2100094|53.0020662 unknown
InChI: InChI=1S/C5H8ClN5/c1-11(8)5-3(7)4(6)9-2-10-5/h2H,7-8H2,1H3
charge 0 multiplicity 1
19 atoms
Cl 3.225072 -1.298862 -0.278349
N  -1.939908 -0.093771 -0.010953
N  -0.297601 1.522824 0.43028
N  -2.357292 -1.453964 -0.130071
N  0.277888 -2.04426 -0.496248
N  2.0734 1.10426 0.324156
C  -0.572357 0.227564 0.104154
C  0.497529 -0.729727 -0.139795
C  -2.989613 0.910095 0.233309
C  1.79306 -0.1666 0.00888
C  1.001147 1.916058 0.522175
H  -2.513527 1.899774 0.278424
H  -3.50882 0.720747 1.195839
H  -3.733326 0.884205 -0.586433
H  -2.812132 -1.786919 0.736573
H  -2.982687 -1.569383 -0.941488
H  1.076116 -2.656945 -0.649384
H  -0.701543 -2.354536 -0.494495
H  1.196093 2.959336 0.778526
