program: Gaussian 09
title: 000234013
version: EM64L-G09RevD.01
frameworkgroup: C1[X(C6H13N7)]
method: RPBEPBE
basis: SDD
operation: Freq
keyword: #pfreq=noraman
keyword: PBEPBE/SDD
title: #p freq=noraman PBEPBE/SDD
converged: YES YES NO NO
title: Mulliken charges:
elementType: N N N N N N N C C C C C C H H H H H H H H H H H H H
charge: -0.197096 -0.169932 -0.088587 -0.029825 -0.661787 -0.537336 -0.548553 0.114436 0.165728 0.111489 -0.618654 -0.597993 -0.400422 0.229002 0.233022 0.243607 0.233950 0.224565 0.231231 0.315099 0.320847 0.240484 0.313524 0.291664 0.283194 0.298342
chargesum: 0.00000
title: Mulliken charges with hydrogens summed into heavy atoms:
elementType: N N N N N N N C C C C C C
charge: -0.197096 -0.169932 -0.088587 -0.029825 -0.025842 0.067852 0.032984 0.114436 0.165728 0.111489 0.086977 0.091754 -0.159938
polarizability: 1.64409003e+02 -9.13899799e-01 1.29221530e+02 2.21764177e+00 4.91857794e+00 7.47795236e+01
1716.lowfreq: -14.9842 -12.6218 -4.7975 -0.0001 0.0003 0.0004 52.5139 68.8202 109.2873
frequency: 52.4400 68.8157 109.2819 138.4754 154.9901 190.3606 199.2511 206.8543 229.1762 233.0297 256.1323 292.0335 302.6899 320.2243 380.9516 392.6821 435.8819 506.0319 519.5938 535.0377 566.5880 587.5716 653.1091 661.1890 681.0023 721.3826 776.9146 786.6621 825.1915 837.0510 903.1573 955.5126 986.4847 1107.4206 1112.8897 1117.4924 1141.7252 1149.2358 1174.7216 1211.0699 1229.0463 1255.8719 1276.3840 1303.4104 1307.9150 1320.5299 1402.2876 1407.7985 1428.7989 1440.7909 1458.3949 1469.6912 1480.3287 1488.6117 1518.2566 1537.4676 1612.0794 1662.8285 1663.6552 2960.3409 2973.1378 3060.6449 3075.4086 3112.9647 3125.3539 3160.4488 3347.4108 3359.8972 3456.6882 3485.3605 3515.9102 3596.7683
redmass: 3.5348 3.2013 3.5085 2.4944 2.4277 1.7718 1.2791 1.2155 1.5084 2.7825 1.5590 3.3855 3.3731 3.4718 3.0248 4.0169 3.9643 1.3770 3.8179 2.8759 3.3400 4.6320 3.1645 6.3877 1.8681 1.8265 4.3426 4.5356 3.7443 2.6083 1.4288 2.9665 2.1918 1.4270 1.2946 1.4045 2.7189 2.9609 2.8501 4.3534 2.5536 1.4407 1.2216 2.6560 6.5852 5.6183 1.5027 2.0356 1.3259 1.5597 1.1172 1.0718 1.0792 1.1426 4.8126 6.0982 1.2146 1.0762 1.0733 1.0415 1.0414 1.0916 1.0908 1.1020 1.1028 1.0919 1.0452 1.0468 1.0448 1.0946 1.0949 1.1006
irintensity: 0.4597 2.2596 2.1407 4.1200 3.2652 7.0053 8.0527 2.8663 100.9112 4.3188 20.8597 24.9935 3.8088 4.0182 13.8246 11.1761 30.8710 49.7496 2.5958 18.2887 5.1799 48.6124 117.6684 19.7928 164.4440 111.8805 32.8106 12.6998 58.9626 69.2699 14.9068 26.9092 87.8595 120.6332 5.6042 12.1959 5.5391 19.1817 0.1588 6.1435 38.3521 48.3511 1.5726 35.8244 1.4782 14.0244 27.1447 91.4604 9.6852 80.0318 17.0686 8.1761 30.8621 0.8598 10.4831 354.8457 125.2430 13.9908 26.7974 76.1227 65.5971 21.9650 30.4710 20.8973 16.9797 20.4992 8.6196 5.6877 15.3790 7.2004 1.3598 17.3484
temp: 298.150 k
press: 1.00000 atm
elementType: 7 7 7 7 7 7 7 6 6 6 6 6 6 1 1 1 1 1 1 1 1 1 1 1 1 1
symmnumber: 1
zpe: 556112.7 jmol-1
zpe.correction: 0.211812 hartree
zpe.thermalcorrener: 0.225835 hartree
zpe.thermalcorrenthalpy: 0.226779 hartree
zpe.thermalcorrgfe: 0.172010 hartree
zpe.sumelectzpe: -618.610604 hartree
zpe.sumelectthermal: -618.596581 hartree
zpe.sumelectthermalent: -618.595637 hartree
zpe.sumelectthermalfe: -618.650406 hartree
dipole: -0.3098 -2.6492 -1.0046
dipole: 2.8501
quadrupole: -85.8969 -74.6103 -73.4150
quadrupole: 0.4760 1.4717 0.5368
quadrupole: -7.9228 3.3638 4.5590 0.4760 1.4717 0.5368
hfenergy: -618.822416 hartree
pointgroup: C01 [X(C6H13N7)]
dipole: -0.1539742 -1.1055987 0.106447 debye
dipolederiv: -0.8099832 -0.1626409 0.107418 -0.8348695 -0.4214212 -0.0846225 0.144294 -0.1381501 -0.217282 -0.7207471 0.1082911 -0.2561393 0.5685241 -0.5100411 0.0187291 0.0244909 -0.107607 -0.08627 -0.6278406 -0.0277197 -0.0045975 -0.008611 -0.4843034 0.1421262 0.1890963 0.1381885 -0.2495588 -0.5598839 0.0340779 -0.0678645 -0.0194951 -0.4931709 0.1549364 -0.2105852 0.1473791 -0.2745473 -0.1544179 -0.0138161 0.0020942 -0.0300344 -1.1639388 0.1530992 0.0536011 0.3809835 -0.5349441 -0.4945948 -0.0739393 0.0684323 -0.1657705 -0.1570144 0.1008754 0.1914092 0.0685364 -0.1620616 -0.7467701 0.1522955 -0.1557433 -0.1035374 -0.0537867 0.0114388 -0.0815363 0.1450133 -0.0865034 -1.0273081 0.033235 -0.1030917 0.0423533 0.9966631 -0.0603436 -0.1015476 -0.0415957 0.0528543 1.4054852 0.5156652 -0.1342456 0.2059521 0.2316331 -0.0464983 -0.0645266 -0.0385084 0.0055329 1.2842246 -0.4980987 0.3485589 -0.1328405 0.2875743 -0.0716295 0.3010729 -0.1578586 0.0569217 0.1321658 0.048142 -0.1158823 0.3781459 0.2936845 -0.0615388 -0.243846 0.0172893 0.352061 0.4424711 0.0805694 -0.0217534 0.1544863 0.2652297 0.055608 -0.1559815 0.0701173 0.1198139 0.3861219 -0.0030029 0.02449 0.0265235 0.3972346 -0.1927224 0.0355988 -0.1965973 -0.0011093 0.032284 -0.0047022 0.0830273 0.056512 -0.0490859 -0.1486945 0.2012326 -0.0210401 -0.0941397 0.0147233 0.1082603 -0.093296 0.0640321 0.0350432 0.0647324 -0.0655778 0.0255467 0.0439522 -0.0596507 -0.1319437 0.0306909 -0.1349926 0.0031153 -0.0022449 -0.0155965 -0.0338117 0.0650711 -0.081025 0.0732693 -0.001691 0.1341663 -0.0124547 0.0072655 -0.0405945 0.0157386 0.1210884 -0.0280645 -0.0201222 0.0077372 -0.1888648 -0.080884 -0.0983371 -0.0317269 -0.1255341 0.0044695 0.0917666 -0.006748 -0.0342009 -0.0620226 0.0801841 0.0537659 0.0187928 0.038982 -0.1148347 0.1277301 0.0378791 0.0434656 -0.0022308 0.2299249 -0.0042878 0.0702934 -0.1205475 0.2842388 0.132668 -0.0282843 -0.0447419 0.0042542 0.23095 -0.0090076 -0.1125101 -0.1196899 0.2910309 0.0633873 -0.0055744 -0.0034653 -0.0060182 -0.0846445 0.0791941 -0.0028912 0.0792348 0.1077583 0.3643292 -0.09734 -0.0442075 0.0551033 0.0770858 0.0350633 -0.1224113 0.0391935 0.1664439 0.290044 0.0618996 0.0650883 0.1261496 0.1598906 0.0116222 -0.0659539 -0.0267185 -0.0115169 0.2535495 0.0635819 0.1630041 0.0365799 0.0484467 -0.0725471 0.0170766 0.0098154 0.0232093 0.2893353 -0.243234 0.1369131 -0.1634952 0.1740858 -0.0359823 0.068327 -0.0483597 0.1383215 unknown
polarizability: 163.6288692|0.7235473|122.1035417|8.1711085|-19.059597|82.677646 unknown
InChI: InChI=1S/C6H13N7/c1-12(8)5-4(7)6(13(2)9)11-3-10-5/h3H,7-9H2,1-2H3
charge 0 multiplicity 1
26 atoms
N  -2.52088 -0.496811 -0.324818
N  2.380804 -0.605491 0.080691
N  -1.184707 1.44232 -0.789663
N  1.2332 1.402168 -0.619703
N  -0.067789 -2.037434 -0.060339
N  -3.628147 0.234288 -0.90174
N  2.453459 -1.158738 1.418497
C  -0.052649 -0.642295 -0.220495
C  -1.240816 0.124645 -0.421104
C  1.178046 0.087892 -0.238682
C  -2.898056 -1.08773 0.987119
C  3.660403 0.001771 -0.341043
C  0.049595 2.002189 -0.919367
H  -3.202991 -0.298887 1.704525
H  -2.046287 -1.644642 1.414245
H  -3.749283 -1.769346 0.837428
H  4.45092 -0.747756 -0.181796
H  3.903463 0.920283 0.229203
H  3.598444 0.270616 -1.407826
H  0.80029 -2.507224 -0.33401
H  -0.935299 -2.505213 -0.333606
H  0.09165 3.035493 -1.275488
H  -3.433221 1.24921 -0.83884
H  -3.731206 -0.046744 -1.887157
H  2.155279 -0.477313 2.135742
H  1.926979 -2.03725 1.494125
