program: Gaussian 09
title: 000022206
version: EM64L-G09RevD.01
frameworkgroup: C1[X(C9H16ClN5)]
method: RPBEPBE
basis: SDD
operation: Freq
keyword: #p
keyword: freq=noraman
keyword: PBEPBE/SDD
title: #p freq=noraman PBEPBE/SDD
converged: YES YES NO NO
title: Mulliken charges:
elementType: Cl N N N N N C C C C C C C C C H H H H H H H H H H H H H H H H
charge: -0.025172 -0.381645 -0.125256 -0.029111 -0.331849 -0.020687 0.309129 -0.747312 -0.698164 -0.698163 0.117101 0.104071 -0.305727 -0.302040 -0.714161 0.222734 0.227468 0.222724 0.260367 0.213662 0.206079 0.213634 0.206046 0.260668 0.336242 0.230405 0.231094 0.336657 0.225495 0.224477 0.231233
chargesum: 0.00000
title: Mulliken charges with hydrogens summed into heavy atoms:
elementType: Cl N N N N N C C C C C C C C C
charge: -0.025172 -0.045403 -0.125256 -0.029111 0.004808 -0.020687 0.309129 -0.074386 -0.018057 -0.017815 0.117101 0.104071 0.155772 -0.302040 -0.032955
polarizability: 1.85717802e+02 3.35205767e+00 1.77151662e+02 -1.16226255e-02 2.05105460e-01 9.04718632e+01
1716.lowfreq: -6.9370 -5.3365 -4.6475 -0.0012 0.0012 0.0015 25.8200 42.2004 68.4921
frequency: 25.5222 42.1637 68.4448 74.4056 89.4379 132.0271 171.5847 181.9921 192.3106 203.3661 204.1009 246.8324 259.0843 266.0032 279.5457 304.9459 324.0053 339.0471 377.6742 411.1268 457.6496 479.8476 515.0623 548.8574 582.3123 642.4459 645.5175 689.6271 703.9996 754.5324 789.7362 796.1917 829.1208 884.5860 915.9148 916.7441 925.6723 954.2818 973.3169 1029.5098 1036.6506 1041.8852 1092.5854 1145.3434 1149.7534 1182.9909 1210.6789 1227.9774 1234.6771 1259.0255 1261.1509 1330.6386 1369.0940 1372.4367 1377.4787 1381.4225 1399.2941 1401.2264 1449.0401 1466.1566 1471.9086 1472.0017 1476.2604 1478.3296 1484.0947 1486.0250 1495.7289 1502.5220 1513.9844 1538.7761 1590.1996 2978.1684 2984.4236 2985.8019 2987.1356 2988.8090 3028.0996 3071.1211 3080.0955 3082.1272 3084.0049 3096.2111 3096.4495 3102.3683 3106.1367 3534.8941 3561.7169
redmass: 2.3275 2.9270 3.7393 3.5001 3.0037 4.7594 7.0116 1.1683 3.7112 2.7667 4.7773 1.1331 1.0578 1.4372 2.3073 6.2059 3.2749 2.4087 2.9722 4.5765 3.0458 4.1679 4.0042 1.1518 1.1712 7.9290 7.3229 5.7287 10.6152 4.1951 7.6336 1.1610 4.3904 8.4224 1.6945 2.0092 1.6433 1.2013 2.8188 2.2718 1.3908 2.1336 3.2421 1.5191 3.8308 3.4289 3.7208 2.5760 3.0270 1.1077 3.9964 1.7104 2.6899 1.2055 1.2663 1.9810 1.2347 1.2424 1.0465 1.0806 1.0820 1.0850 1.2833 1.0405 1.0527 1.3917 1.1143 1.1449 2.2284 8.4433 7.3355 1.0363 1.0351 1.0557 1.0398 1.0363 1.1038 1.1005 1.1001 1.1012 1.0996 1.0984 1.0984 1.1002 1.0996 1.0763 1.0773
irintensity: 0.0313 0.0363 0.9879 0.3047 1.7795 0.1828 1.0494 0.5678 3.2780 1.4216 2.1996 0.0327 0.1930 0.4274 0.5076 15.8596 2.3259 0.4445 4.6024 2.3355 0.8758 3.0650 3.8434 107.5969 46.3070 1.8786 18.8716 10.0977 0.1005 9.1404 35.9879 0.7449 49.2455 17.5195 0.2652 2.1625 7.4135 0.3182 41.1391 6.0507 0.0107 1.2350 0.8895 1.9621 125.6995 26.5864 58.2810 181.7099 20.5317 0.1670 8.3909 194.5112 222.9011 30.9805 26.0885 61.4455 27.4966 52.1314 0.3890 20.4944 17.8486 19.0272 129.1622 13.7171 8.0008 78.0390 92.5898 16.1097 51.9327 1342.0732 333.1138 23.6621 33.9125 25.0973 40.3386 21.2151 13.9002 19.3176 26.8284 49.7807 26.0405 4.8401 71.7321 2.0073 27.2332 62.2838 71.3500
temp: 298.150 k
press: 1.00000 atm
elementType: 17 7 7 7 7 7 6 6 6 6 6 6 6 6 6 1 1 1 1 1 1 1 1 1 1 1 1 1 1 1 1
symmnumber: 1
zpe: 663302.1 jmol-1
zpe.correction: 0.252638 hartree
zpe.thermalcorrener: 0.269351 hartree
zpe.thermalcorrenthalpy: 0.270295 hartree
zpe.thermalcorrgfe: 0.207484 hartree
zpe.sumelectzpe: -1085.240248 hartree
zpe.sumelectthermal: -1085.223536 hartree
zpe.sumelectthermalent: -1085.222592 hartree
zpe.sumelectthermalfe: -1085.285403 hartree
dipole: 3.9441 4.4557 -0.0007
dipole: 5.9506
quadrupole: -94.3438 -92.0885 -98.3277
quadrupole: -14.1784 -0.0412 0.0172
quadrupole: 0.5762 2.8315 -3.4077 -14.1784 -0.0412 0.0172
hfenergy: -1085.4928868 hartree
pointgroup: C01 [X(C9H16Cl1N5)]
dipole: -1.030176 2.1022924 0.0015854 debye
polarizability: 183.3956429|-5.0730416|179.4739383|-0.0958944|-0.1504504|90.4717459 unknown
InChI: InChI=1S/C9H16ClN5/c1-5-11-7-12-6(10)13-8(14-7)15-9(2,3)4/h11,15H,5H2,1-4H3
charge 0 multiplicity 1
31 atoms
Cl 2.259245 -3.670587 0.000956
N  -1.869482 -0.829194 0.001704
N  0.191569 0.365915 -0.007644
N  0.086489 -2.080022 0.000176
N  2.328628 1.35532 -0.010308
N  2.243238 -0.977951 -0.006205
C  -2.813588 0.330499 0.001561
C  -4.235321 -0.283317 0.009568
C  -2.601784 1.192806 1.273507
C  -2.612124 1.18395 -1.278013
C  -0.504619 -0.815271 -0.002719
C  1.555338 0.230898 -0.008461
C  1.792642 2.726337 -0.013068
C  1.42801 -2.047037 -0.002423
C  2.941563 3.747241 0.019433
H  -4.398223 -0.902203 0.911842
H  -4.990179 0.521204 0.00999
H  -4.40578 -0.908328 -0.88707
H  -1.577345 1.598699 1.291964
H  -2.761233 0.588792 2.184942
H  -3.318987 2.033743 1.282062
H  -2.779088 0.573577 -2.183845
H  -3.329311 2.024906 -1.286636
H  -1.587817 1.589508 -1.307648
H  -2.264928 -1.772991 0.006051
H  1.164677 2.874308 -0.912797
H  1.126863 2.860399 0.860932
H  3.338226 1.19917 -0.010997
H  3.557576 3.62897 0.929689
H  3.5980 3.642587 -0.864043
H  2.535948 4.773372 0.017601
