program: Gaussian 09
title: 000234012
version: EM64L-G09RevD.01
frameworkgroup: C1[X(C6H7N5)]
method: RPBEPBE
basis: SDD
operation: Freq
keyword: #p
keyword: freq=noraman
keyword: PBEPBE/SDD
title: #p freq=noraman PBEPBE/SDD
converged: YES YES NO NO
title: Mulliken charges:
elementType: N N N N N C C C C C C H H H H H H H
charge: -0.141756 -0.278034 -0.044894 -0.096821 -0.011071 0.239332 0.070026 -0.629285 -0.233475 -0.341464 -0.357180 0.314939 0.222866 0.294991 0.236645 0.245283 0.264816 0.245082
chargesum: 0.00000
title: Mulliken charges with hydrogens summed into heavy atoms:
elementType: N N N N N C C C C C C
charge: -0.141756 0.036906 -0.044894 -0.096821 -0.011071 0.239332 0.070026 0.125218 0.011807 -0.076649 -0.112098
polarizability: 1.47107185e+02 6.60672453e-01 1.02820130e+02 1.94289949e+00 -1.20374815e+00 4.58053043e+01
1716.lowfreq: -15.4131 -0.0010 -0.0007 -0.0005 2.8751 11.3669 66.3829 113.0314 153.9704
frequency: 66.3750 113.0245 153.9686 198.9278 269.5958 282.4110 381.3532 427.5897 434.2687 493.8192 518.4687 528.1814 569.5266 608.0938 684.6455 769.3235 805.2962 841.8351 878.3374 905.4533 937.6934 952.1141 1046.3565 1095.8216 1121.9611 1145.7231 1158.4582 1178.3692 1246.8359 1302.6972 1331.4527 1357.0473 1384.4523 1400.2112 1414.3683 1452.7357 1476.2564 1493.6527 1511.0957 1535.1554 1603.2272 2962.3637 3044.6337 3121.2902 3133.4236 3160.7301 3165.4271 3479.9183
redmass: 3.6119 3.0759 2.5054 1.5400 3.9245 3.2456 3.3576 3.1894 3.1792 5.9131 2.7191 3.8260 6.5237 5.4704 6.4963 5.2180 8.1291 4.7776 1.5005 1.5280 1.4925 2.4343 5.8556 4.0308 1.3969 1.9379 2.8053 3.6711 4.4167 3.8194 2.3775 1.4259 1.6065 1.5751 1.3794 1.4397 1.0519 2.2002 2.5662 6.0563 6.1528 1.0369 1.1010 1.0971 1.0923 1.0903 1.0951 1.0786
irintensity: 3.6248 9.5783 2.7196 6.9310 11.6287 5.9209 0.8282 48.6051 123.1535 8.9157 65.1171 10.8283 10.2704 19.7716 6.8254 15.7720 6.9872 1.6185 1.4141 34.9142 0.4801 15.5281 21.3497 6.8298 18.7028 21.7260 21.3057 11.3805 25.8802 18.0383 43.1881 1.4141 44.6316 63.9027 81.1184 6.5959 22.1717 40.6008 10.8431 13.9289 310.3267 90.6799 36.5430 0.2505 13.1147 26.2457 2.7434 15.4198
temp: 298.150 k
press: 1.00000 atm
elementType: 7 7 7 7 7 6 6 6 6 6 6 1 1 1 1 1 1 1
symmnumber: 1
zpe: 353759.5 jmol-1
zpe.correction: 0.134740 hartree
zpe.thermalcorrener: 0.143836 hartree
zpe.thermalcorrenthalpy: 0.144780 hartree
zpe.thermalcorrgfe: 0.100325 hartree
zpe.sumelectzpe: -505.741746 hartree
zpe.sumelectthermal: -505.732650 hartree
zpe.sumelectthermalent: -505.731705 hartree
zpe.sumelectthermalfe: -505.776161 hartree
dipole: -6.0439 1.3768 -0.4167
dipole: 6.2127
quadrupole: -58.3899 -65.3828 -65.5713
quadrupole: 0.7928 2.3024 1.4016
quadrupole: 4.7248 -2.2681 -2.4567 0.7928 2.3024 1.4016
hfenergy: -505.8764856 hartree
pointgroup: C01 [X(C6H7N5)]
dipole: 2.3566512 -0.6403743 -0.1027415 debye
dipolederiv: -0.7769535 0.2767384 0.0892073 0.6949608 -0.2446303 0.0268024 0.3850534 -0.129481 -0.2815243 -0.4646128 0.3246464 -0.132875 0.6189669 -0.6215315 0.1094757 -0.4526028 0.1369938 -0.1655217 -0.962836 0.0162926 -0.0393676 -0.040246 -0.3823649 -0.0105688 0.006426 -0.0434979 -0.2710915 -0.8665223 0.100771 0.0103117 -0.2890324 -0.386791 -0.0230169 -0.014662 -0.026525 -0.2365623 -0.5711843 0.1321344 0.0010686 -0.3355451 -0.5301559 -0.0567401 -0.0424514 -0.0315025 -0.2279894 1.2179809 -0.2852809 -0.0619011 -0.3538245 0.1282932 0.0264166 -0.087604 0.0180242 0.2079564 0.1579722 0.4168835 0.0562162 0.5926542 -0.1269629 -0.0010277 0.039509 0.0010047 0.089019 0.1900492 -0.2513218 0.0083234 -0.4529218 0.3854524 -0.0804839 -0.0967298 -0.0185306 0.3048155 0.9285935 -0.3368674 0.052595 -0.6818874 0.6577555 -0.0031807 0.0197366 0.1005595 0.0207898 0.3617655 -0.2670114 -0.0241254 0.1786314 0.3566344 0.0670557 0.0177347 0.048926 -0.0658006 0.4956609 -0.0701037 -0.0160937 0.1684523 0.4745842 0.0726948 0.0233295 0.0619449 -0.0433125 0.2102777 -0.0409566 0.0528427 -0.0521169 0.1632256 -0.0495901 0.2654395 -0.1160277 0.2829461 -0.0935873 0.1419808 0.1018914 0.0558075 0.0436041 0.0063307 0.1311574 -0.0366493 -0.0165652 0.1014265 -0.1204984 -0.0063381 -0.0270004 0.0786019 0.0010825 -0.0102184 -0.010171 0.1319401 0.007573 0.0974207 -0.0777629 0.0777708 0.0289775 -0.030825 -0.1491691 0.0893467 -0.1324504 -0.0494029 -0.079218 -0.0047528 -0.0684277 0.0395151 -0.0124057 -0.0319282 -0.0046228 0.1362855 0.1177678 0.0264256 0.0026188 0.0129748 -0.055537 -0.0257245 0.0133166 -0.0265225 0.1373153 -0.0039681 -0.0820352 -0.0118586 -0.0992164 -0.0086703 -0.0162954 -0.016337 -0.0132696 0.1297501 unknown
polarizability: 147.0583356|-1.4751784|102.4969862|2.3153424|4.6231298|46.1772976 unknown
InChI: InChI=1S/C6H7N5/c1-11-6-5(8-4-10-11)2-7-3-9-6/h2-4,10H,1H3
charge 0 multiplicity 1
18 atoms
N  1.344587 -0.861525 -0.208711
N  2.322814 0.182716 0.03865
N  0.647148 1.924481 0.19177
N  -0.948407 -1.455389 -0.262874
N  -2.700942 0.238358 -0.086681
C  -0.004284 -0.485133 -0.149927
C  -0.347678 0.902939 0.024701
C  1.796113 -2.213891 0.140427
C  1.891233 1.508591 0.150188
C  -1.715783 1.20306 0.044016
C  -2.257565 -1.033201 -0.225068
H  3.214961 -0.001561 -0.432549
H  2.601449 -2.544261 -0.541688
H  0.928783 -2.880177 0.020651
H  2.160943 -2.255324 1.186107
H  2.709886 2.232382 0.242318
H  -2.043583 2.237872 0.181349
H  -3.014077 -1.818737 -0.31348
