program: Gaussian 09
title: 000234010
version: EM64L-G09RevD.01
frameworkgroup: C1[X(C7H7ClN4O)]
method: RPBEPBE
basis: SDD
operation: Freq
keyword: #p
keyword: freq=noraman
keyword: PBEPBE/SDD
title: #p freq=noraman PBEPBE/SDD
converged: YES YES NO NO
title: Mulliken charges:
elementType: Cl O N N N N C C C C C C C H H H H H H H
charge: 0.021749 -0.440035 -0.169231 -0.035166 -0.022864 0.059359 -0.382393 0.138196 0.144403 -0.183006 -0.325852 -0.308616 -0.355463 0.238523 0.259042 0.300961 0.214362 0.243425 0.255242 0.347363
chargesum: 0.00000
title: Mulliken charges with hydrogens summed into heavy atoms:
elementType: Cl O N N N N C C C C C C C
charge: 0.021749 -0.092672 -0.169231 -0.035166 -0.022864 0.059359 0.115172 0.138196 0.144403 0.117956 0.131936 -0.308616 -0.100221
polarizability: 1.61352375e+02 2.01150074e-01 1.22824839e+02 -8.68768516e+00 2.64767224e+00 5.70137868e+01
1716.lowfreq: -7.4122 -5.0123 -0.0019 0.0012 0.0020 9.9337 26.5820 69.6417 109.9625
frequency: 26.4694 69.6147 109.9605 154.5798 180.7287 217.1000 228.4535 264.3331 298.2453 345.8772 375.6756 443.5208 535.0713 548.2216 567.4855 626.0418 644.1383 646.9127 685.1754 792.0892 802.4475 851.0061 865.6029 891.0650 914.4519 955.4488 995.4211 1046.3422 1092.8113 1108.9044 1163.0926 1183.0427 1196.8574 1251.8271 1286.0038 1304.8293 1317.1961 1330.5267 1364.7998 1375.2700 1380.6628 1398.9257 1445.5742 1456.7184 1471.5027 1505.9421 1564.0304 2985.5711 2995.2800 3062.2913 3100.5081 3187.1569 3249.6023 3568.7333
redmass: 5.3254 5.2626 5.7583 4.5615 6.6695 6.5273 4.8984 3.6418 1.3595 2.2630 15.4481 4.0618 3.9704 7.7100 3.8813 7.0352 5.3183 6.1118 5.0810 8.7198 11.3428 3.0429 1.4257 6.0532 1.4313 2.0482 2.3987 2.1587 3.7330 4.7054 3.2016 1.5786 1.8990 1.8107 5.0803 4.5689 2.0754 1.2701 3.8066 1.2669 1.4149 1.9096 2.8055 1.0795 1.2959 9.2754 10.4011 1.0658 1.0641 1.1003 1.0988 1.0929 1.0996 1.0666
irintensity: 1.3541 4.8376 6.7394 2.7253 1.9941 0.3385 8.1023 17.9310 158.0406 16.9694 8.5668 17.7806 1.2979 20.4486 1.8222 3.6428 18.1605 9.1160 7.6985 3.0761 34.6243 12.9388 17.3292 73.5511 13.0390 32.5959 93.1009 12.2027 13.1530 3.1959 24.1699 29.2099 78.3255 40.9274 64.7925 83.8024 27.4026 14.3288 9.4485 10.4822 8.9006 57.9445 69.8046 4.3136 35.1406 129.5097 77.6580 32.8410 62.3622 4.5171 21.2155 9.6907 7.1252 9.4892
temp: 298.150 k
press: 1.00000 atm
elementType: 17 8 7 7 7 7 6 6 6 6 6 6 6 1 1 1 1 1 1 1
symmnumber: 1
zpe: 373409.2 jmol-1
zpe.correction: 0.142224 hartree
zpe.thermalcorrener: 0.153419 hartree
zpe.thermalcorrenthalpy: 0.154363 hartree
zpe.thermalcorrgfe: 0.103569 hartree
zpe.sumelectzpe: -1024.270371 hartree
zpe.sumelectthermal: -1024.259177 hartree
zpe.sumelectthermalent: -1024.258232 hartree
zpe.sumelectthermalfe: -1024.309026 hartree
dipole: 6.8863 2.4157 -1.4196
dipole: 7.4345
quadrupole: -73.6760 -87.7981 -80.7872
quadrupole: 2.2268 -6.2139 2.3760
quadrupole: 7.0778 -7.0443 -0.0334 2.2268 -6.2139 2.3760
hfenergy: -1024.4125955 hartree
pointgroup: C01 [X(C7H7Cl1N4O1)]
dipole: -2.6667217 -0.9523304 -0.7328393 debye
dipolederiv: -0.6105081 -0.4067446 -0.1081102 -0.491356 -0.4544397 -0.1019392 -0.125446 -0.0975099 -0.0858644 -0.716917 0.1696531 0.2237277 0.233126 -0.627378 0.0496675 0.310378 0.0835632 -0.2869413 -0.7886945 0.0477485 -0.0078464 -0.2858031 -0.4869268 -0.0790641 -0.0008687 -0.0482987 -0.1726152 -0.6981039 -0.0015866 -0.0187465 0.0742827 -0.3384833 -0.0031525 -0.0296594 -0.012408 -0.2467732 -0.6278003 -0.0369643 -0.0416002 0.040315 -0.4646235 -0.0481344 -0.0375009 -0.0471113 -0.1899432 -0.5153501 0.0282946 -0.0272091 -0.2831614 -1.0120564 -0.1505116 -0.0781199 -0.1186995 -0.174687 0.5124964 0.1688307 0.1089762 0.3835319 0.0989877 0.0087142 0.2260392 -0.0551647 0.2061659 0.8683402 -0.2960445 0.0126983 0.0660579 0.1300691 0.0295852 0.0850833 -0.0255567 0.1132825 -0.5426522 -0.2655779 -0.0914873 -0.6454554 0.0244195 -0.0614181 -0.1727111 -0.0394208 0.0770069 0.3632406 0.1581567 0.0433227 0.4595223 0.4805794 0.0989418 0.0570363 0.1088026 0.0038334 0.4901828 -0.1718802 -0.0682432 -0.230613 0.5368031 -0.0459116 -0.1380567 -0.0342769 0.2389589 1.2512643 0.4770804 0.1808598 0.7121326 1.1539365 0.2253053 0.2242168 0.2076727 0.0967778 0.5587887 0.0950861 0.0723839 0.0717091 0.6237638 0.1056211 0.0742324 0.1079247 -0.0361729 -0.0926062 -0.0285331 -0.0658102 -0.0183762 0.0803393 0.0758445 -0.1090704 0.0176984 -0.0892832 0.0857485 0.0667699 0.0135126 -0.0466729 -0.0257213 -0.0088009 0.0117958 0.0072837 0.1080979 0.121446 0.0348084 -0.0169752 0.0209485 0.1251039 -0.0070195 -0.0114498 -0.0103853 0.1617528 -0.1541119 -0.1072044 0.00068 -0.0839212 -0.1047045 -0.003719 -0.0073934 -0.0447876 0.0891202 0.0786665 0.0486025 -0.0746057 0.0497846 0.0454633 -0.0076692 -0.06 0.0338471 -0.0643153 0.0711172 0.0336957 -0.0012649 0.027665 -0.0452609 -0.0232215 -0.0021048 -0.0234909 0.1331169 0.345453 -0.0141909 -0.1342623 -0.0537167 0.2601286 -0.0531179 -0.2164008 -0.009682 0.1184827 unknown
polarizability: 161.2720961|0.294257|121.7244186|8.9409536|9.0548119|58.1944867 unknown
InChI: InChI=1S/C7H7ClN4O/c8-6-5-7(10-3-9-6)12(1-2-13)4-11-5/h3-4,13H,1-2H2
charge 0 multiplicity 1
20 atoms
Cl 3.674386 1.435193 0.380921
O  -3.974993 1.006431 0.467098
N  -1.151778 0.083917 -0.30065
N  0.329405 1.803883 0.10276
N  0.443716 -1.803492 -0.412059
N  2.753873 -1.079956 -0.071771
C  -2.404499 -0.653136 -0.546442
C  0.116682 -0.495825 -0.257972
C  1.027494 0.591177 -0.006872
C  -0.960414 1.460688 -0.07681
C  -3.478019 -0.378035 0.521084
C  2.383083 0.202966 0.074235
C  1.784492 -2.026301 -0.305042
H  -2.793824 -0.398311 -1.551401
H  -2.134034 -1.725016 -0.550264
H  -1.804799 2.143839 -0.028345
H  -4.304495 -1.107395 0.398625
H  -3.052721 -0.490571 1.530949
H  2.130772 -3.056395 -0.415552
H  -4.601029 1.104037 -0.293989
