program: Gaussian 09
title: 000234004
version: EM64L-G09RevD.01
frameworkgroup: C1[X(C10H11IN4O)]
method: RPBEPBE
basis: SDD
operation: Freq
keyword: #p
keyword: freq=noraman
keyword: PBEPBE/SDD
title: #p freq=noraman PBEPBE/SDD
converged: YES YES NO NO
title: Mulliken charges:
elementType: I O N N N N C C C C C C C C C C H H H H H H H H H H H
charge: 0.122194 -0.272190 -0.192242 -0.042635 -0.012393 0.047553 0.012965 -0.409345 -0.413498 -0.378161 -0.307035 0.110698 -0.193987 0.172595 -0.424355 -0.356405 0.245572 0.219254 0.237096 0.232375 0.205622 0.209588 0.216561 0.190291 0.232003 0.293381 0.254498
chargesum: 0.00000
title: Mulliken charges with hydrogens summed into heavy atoms:
elementType: I O N N N N C C C C C C C C C C
charge: 0.122194 -0.272190 -0.192242 -0.042635 -0.012393 0.047553 0.258537 0.047005 0.024500 0.047988 0.115259 0.110698 0.099394 0.172595 -0.424355 -0.101907
polarizability: 2.49539856e+02 6.31476702e+00 1.53237327e+02 -5.08821264e+00 -5.72703539e+00 8.48836458e+01
1716.lowfreq: -25.4160 -8.2652 -3.4806 -2.7415 -0.0006 -0.0002 0.0004 30.4059 58.9692
frequency: -20.4163 29.6370 58.9470 111.0892 119.9564 169.6950 218.7437 224.4907 235.6660 251.6701 274.6487 325.3484 370.1023 440.4235 451.9478 517.5985 531.2980 540.0657 606.7442 622.6703 638.0376 644.9190 756.3262 791.4256 795.3558 804.6791 827.6906 859.2082 860.8590 867.0434 903.0045 913.6356 931.3499 984.5536 1021.1901 1041.8406 1078.2056 1090.7119 1106.7732 1127.5949 1158.6246 1164.3072 1189.7298 1200.3055 1250.9375 1253.0718 1271.5519 1292.0151 1300.8928 1311.5648 1331.3073 1337.7400 1343.0303 1358.0661 1363.1611 1378.6838 1393.8667 1442.3519 1447.1517 1457.1369 1459.8813 1469.0338 1495.6157 1553.0479 2950.0994 2959.7607 2979.2336 2994.2463 2998.4219 3052.0113 3059.2232 3068.6939 3091.2424 3185.8753 3259.7646
redmass: 3.8816 6.0113 4.7859 7.4350 7.9240 4.8259 4.3600 2.8510 6.1732 5.0062 6.6723 1.9195 6.0110 3.4443 3.2518 2.0354 5.6707 5.2417 7.8469 6.4191 6.5991 5.2598 3.7534 5.8479 6.0858 3.3920 1.7076 1.6521 2.1446 3.8018 3.2139 1.4292 2.0258 1.9899 3.1422 2.2471 4.0793 2.3040 4.9466 2.5574 2.6380 1.6385 1.5069 1.9659 1.3035 1.3252 3.8824 2.4074 4.2636 1.4113 1.3983 1.4197 1.4341 1.2737 5.2928 1.4675 1.8521 4.1475 1.1267 1.1095 1.0855 1.0930 8.9763 10.9440 1.0690 1.0843 1.0655 1.0606 1.0605 1.0971 1.1016 1.1037 1.0970 1.0928 1.0990
irintensity: 1.0182 0.9713 1.0587 0.2991 1.3624 1.8208 1.1957 4.1803 1.8756 0.9504 2.8162 1.7504 0.3989 0.2740 5.6346 4.6422 1.5381 20.4832 5.6264 0.9944 9.0706 16.4656 53.2888 34.3374 4.8719 10.1352 6.7268 14.2001 29.6270 62.3951 17.6109 12.1146 10.1029 12.0619 157.5977 2.3711 22.3597 28.1165 1.8730 8.1138 59.6376 7.3352 106.6131 129.7878 7.2187 11.2993 41.6508 17.9383 117.4701 1.4358 6.3084 0.1604 4.0143 10.8455 37.8099 10.5747 112.2434 190.6242 2.7846 19.5224 8.4902 15.1299 169.6219 70.7636 56.0074 12.9085 30.6646 32.6373 20.3932 33.2650 35.2593 38.7549 30.0843 11.5264 2.8023
temp: 298.150 k
press: 1.00000 atm
elementType: 53 8 7 7 7 7 6 6 6 6 6 6 6 6 6 6 1 1 1 1 1 1 1 1 1 1 1
symmnumber: 1
zpe: 538120.9 jmol-1
zpe.correction: 0.204959 hartree
zpe.thermalcorrener: 0.217651 hartree
zpe.thermalcorrenthalpy: 0.218595 hartree
zpe.thermalcorrgfe: 0.163540 hartree
zpe.sumelectzpe: -692.214911 hartree
zpe.sumelectthermal: -692.202219 hartree
zpe.sumelectthermalent: -692.201275 hartree
zpe.sumelectthermalfe: -692.256330 hartree
dipole: 7.5884 0.5536 0.8477
dipole: 7.6556
quadrupole: -86.1305 -110.8350 -107.8416
quadrupole: 1.1134 1.6324 -0.7059
quadrupole: 15.4718 -9.2326 -6.2392 1.1134 1.6324 -0.7059
hfenergy: -692.4198701 hartree
pointgroup: C01 [X(C10H11I1N4O1)]
dipole: -2.9365913 0.6344459 -0.2137963 debye
polarizability: 245.6771811|-18.3369532|155.7352401|-9.950207|10.8201321|86.2484076 unknown
InChI: InChI=1S/C10H11IN4O/c11-9-8-10(13-5-12-9)15(6-14-8)7-3-1-2-4-16-7/h5-7H,1-4H2
charge 0 multiplicity 1
27 atoms
I  4.940433 -1.285618 -0.375152
O  -2.44952 -0.876168 0.862786
N  -0.319289 -0.366439 0.067127
N  1.390245 -1.865872 -0.275725
N  1.007614 1.701335 0.364476
N  3.408962 1.281978 0.171162
C  -1.678545 0.176462 0.197768
C  -2.297556 0.554476 -1.165033
C  -3.763777 1.007607 -0.962985
C  -4.562232 -0.079384 -0.204725
C  -3.845695 -0.443083 1.108198
C  0.860159 0.371558 0.140485
C  0.057839 -1.695879 -0.182461
C  1.919827 -0.581286 -0.080947
C  3.222026 -0.032327 -0.053696
C  2.314616 2.090514 0.371418
H  -1.608858 1.07838 0.844248
H  -2.259233 -0.330402 -1.82884
H  -1.691876 1.35567 -1.626735
H  -4.229429 1.223525 -1.941067
H  -3.7825 1.953701 -0.383809
H  -5.585939 0.27245 0.025523
H  -4.653269 -0.98582 -0.833016
H  -3.835332 0.428673 1.798718
H  -4.312324 -1.300075 1.61922
H  -0.680658 -2.489104 -0.254481
H  2.519512 3.148228 0.552444
