program: Gaussian 09
title: 000234001
version: EM64L-G09RevD.01
frameworkgroup: C1[X(C11H14N4OS)]
method: RPBEPBE
basis: SDD
operation: Freq
keyword: #p
keyword: freq=noraman
keyword: PBEPBE/SDD
title: #p freq=noraman PBEPBE/SDD
converged: YES YES NO NO
title: Mulliken charges:
elementType: S O N N N N C C C C C C C C C C C H H H H H H H H H H H H H H
charge: 0.275151 -0.263609 -0.189213 -0.056434 -0.027747 0.001305 -0.001970 -0.413862 -0.411426 -0.377779 -0.307613 0.122288 -0.203182 0.110918 -0.358571 -0.382608 -0.824419 0.247720 0.232552 0.219004 0.204587 0.228989 0.214984 0.206699 0.229916 0.188416 0.285188 0.246318 0.281073 0.281790 0.241534
chargesum: 0.00000
title: Mulliken charges with hydrogens summed into heavy atoms:
elementType: S O N N N N C C C C C C C C C C C
charge: 0.275151 -0.263609 -0.189213 -0.056434 -0.027747 0.001305 0.245749 0.037694 0.022150 0.043904 0.110719 0.122288 0.082006 0.110918 -0.358571 -0.136290 -0.020022
polarizability: 2.58570184e+02 2.75975784e+00 1.55808198e+02 3.03852923e+00 -5.26340645e+00 9.71166888e+01
1716.lowfreq: -8.2179 -1.4775 -0.0016 -0.0012 0.0004 4.9301 12.1329 42.0030 61.1652
frequency: 9.2731 41.9219 61.1578 73.7431 100.8682 130.8040 141.6298 189.1484 215.4220 221.1414 227.4550 260.7633 284.4525 328.5974 374.8793 401.8721 441.4751 451.9716 519.4784 545.2322 555.3725 616.2740 627.0714 647.4998 652.3177 662.1631 765.5977 791.5004 799.5127 815.8198 830.7426 846.3435 861.1699 876.4676 918.2113 922.6295 931.0820 977.2193 985.0166 993.8118 1016.7395 1043.5020 1089.3372 1094.0660 1109.6618 1133.6598 1163.3479 1180.0002 1190.4144 1205.5443 1250.3608 1254.2725 1282.9533 1296.0735 1302.3191 1314.3959 1332.9342 1339.2517 1343.5334 1344.8095 1361.5313 1366.8101 1385.6490 1395.0177 1433.4831 1443.7480 1448.3277 1448.6970 1456.2538 1460.6845 1471.7663 1517.8141 1542.8167 2946.9308 2964.2350 2976.8633 2992.1527 2996.0927 3026.1508 3048.3152 3056.2211 3065.6772 3089.0461 3151.2220 3158.0405 3169.9889 3252.6423
redmass: 3.9352 4.4969 4.1720 3.4715 1.1475 5.0802 4.4536 4.7746 4.0221 3.8933 2.8841 5.2421 4.2501 2.0266 5.8818 11.4415 3.6779 3.1738 1.8506 5.0260 6.1421 7.7244 7.4498 4.7866 6.9180 7.6799 3.3609 6.5827 2.9947 7.1664 1.7720 1.5176 2.4509 3.0266 1.4335 3.7812 1.9955 1.1812 1.6580 1.5307 3.0612 2.2513 2.2906 3.3979 4.6800 2.6204 1.4238 3.8875 1.4554 1.9928 1.2860 1.3651 2.8010 3.3840 4.3800 1.4792 1.4083 1.4104 1.1456 1.4302 1.2683 5.3888 1.4223 1.7964 1.0526 3.5326 1.0792 1.1384 1.1202 1.0858 1.0930 9.3901 10.4739 1.0691 1.0844 1.0653 1.0607 1.0608 1.0282 1.0969 1.1018 1.1036 1.0966 1.1042 1.1055 1.0922 1.0987
irintensity: 0.1660 2.8387 1.3586 2.1017 0.1851 0.3823 2.0647 2.7364 1.2553 1.1632 4.1907 0.5547 1.5908 2.4346 0.4481 4.8492 0.8076 4.7308 4.1008 0.6838 14.5600 3.6919 3.6226 17.0474 2.3597 1.3677 27.9816 3.4549 7.0027 24.4513 6.0404 14.9066 11.5176 70.3549 11.7525 41.8826 14.1089 6.9771 9.1787 12.7548 153.9828 4.4785 8.1755 28.8889 3.0487 8.4260 16.0598 44.9299 62.3994 156.1024 7.9770 7.5168 28.0264 32.0963 67.2820 3.2782 6.3043 0.0924 1.8652 4.0548 11.8602 28.9988 6.5012 57.0415 14.0184 96.6516 20.2222 29.5599 22.5477 7.5353 15.2465 185.2005 129.0528 58.5062 6.6474 31.7748 34.6884 22.1758 24.1913 35.9815 37.1080 41.5163 32.6603 8.3598 10.0929 15.5108 1.2086
temp: 298.150 k
press: 1.00000 atm
elementType: 16 8 7 7 7 7 6 6 6 6 6 6 6 6 6 6 6 1 1 1 1 1 1 1 1 1 1 1 1 1 1
symmnumber: 1
zpe: 640064.7 jmol-1
zpe.correction: 0.243788 hartree
zpe.thermalcorrener: 0.259253 hartree
zpe.thermalcorrenthalpy: 0.260197 hartree
zpe.thermalcorrgfe: 0.198587 hartree
zpe.sumelectzpe: -1118.590812 hartree
zpe.sumelectthermal: -1118.575346 hartree
zpe.sumelectthermalent: -1118.574402 hartree
zpe.sumelectthermalfe: -1118.636013 hartree
dipole: -4.3098 1.8988 0.9271
dipole: 4.7999
quadrupole: -80.0775 -113.6113 -108.1941
quadrupole: 4.1668 -1.9088 -0.5544
quadrupole: 20.5502 -12.9837 -7.5664 4.1668 -1.9088 -0.5544
hfenergy: -1118.8345993 hartree
pointgroup: C01 [X(C11H14N4O1S1)]
dipole: 1.654025 -0.8666195 0.2817653 debye
polarizability: 258.6624733|-1.7160122|152.8502169|1.1904191|13.7990368|99.9823812 unknown
InChI: InChI=1S/C11H14N4OS/c1-17-11-9-10(12-6-13-11)15(7-14-9)8-4-2-3-5-16-8/h6-8H,2-5H2,1H3
charge 0 multiplicity 1
31 atoms
S  -4.289047 1.272742 0.148854
O  2.806379 0.8197 -0.915876
N  0.680896 0.394327 -0.039488
N  -1.003573 1.907617 0.35093
N  -0.680957 -1.596112 -0.610701
N  -3.084442 -1.12096 -0.50848
C  2.025408 -0.17188 -0.164064
C  2.67608 -0.470525 1.203524
C  4.125877 -0.971322 0.996067
C  4.928676 0.039838 0.143217
C  4.18201 0.332731 -1.170756
C  -0.515316 -0.294219 -0.251559
C  0.326594 1.706029 0.315869
C  -1.552252 0.65988 0.001679
C  -2.880345 0.178488 -0.144408
C  -1.99879 -1.931363 -0.722188
C  -5.704171 0.080889 -0.199543
H  1.923184 -1.111067 -0.749937
H  2.066957 -1.223241 1.737085
H  2.676374 0.457326 1.807285
H  4.106264 -1.954637 0.482356
H  4.614127 -1.132414 1.974037
H  5.060551 0.984462 0.704897
H  5.936642 -0.354462 -0.0886
H  4.656081 1.139587 -1.75212
H  4.130233 -0.583527 -1.799634
H  1.078558 2.467987 0.501455
H  -2.219268 -2.961883 -1.014081
H  -5.653196 -0.7696 0.493836
H  -5.638732 -0.281015 -1.234667
H  -6.621902 0.668323 -0.041388
