program: Gaussian 09
title: 000233993
version: EM64L-G09RevD.01
frameworkgroup: C1[X(C14H11NS)]
method: RPBEPBE
basis: SDD
operation: Freq
keyword: #p
keyword: freq=noraman
keyword: PBEPBE/SDD
title: #p freq=noraman PBEPBE/SDD
converged: NO YES NO NO
title: Mulliken charges:
elementType: S N C C C C C C C C C C C C C C H H H H H H H H H H H
charge: 0.236942 -0.005714 -0.579212 -0.157371 0.421832 -0.343171 0.328289 -0.379767 -0.378913 -0.277987 -0.345844 -0.238317 -0.213991 -0.223332 -0.223359 -0.237679 0.248875 0.248932 0.236420 0.236494 0.245176 0.256616 0.229572 0.231059 0.227443 0.227452 0.229555
chargesum: 0.00000
title: Mulliken charges with hydrogens summed into heavy atoms:
elementType: S N C C C C C C C C C C C C C C
charge: 0.236942 -0.005714 -0.081405 -0.157371 0.421832 -0.343171 0.328289 -0.143347 -0.142419 -0.032811 -0.089228 -0.008745 0.017068 0.004111 0.004092 -0.008123
polarizability: 2.51108266e+02 -1.37021292e+01 1.48965748e+02 -2.49862982e-01 4.36111672e-02 1.10052646e+02
1716.lowfreq: -22.8829 -15.7732 -0.0022 -0.0020 -0.0016 2.8679 4.8813 12.2685 51.3768
frequency: -22.7530 8.8031 51.3574 99.1876 173.2830 188.4874 233.9943 275.9791 310.9558 364.0465 401.5414 429.8103 437.2962 486.8656 498.4046 514.4476 537.6409 583.7436 613.0411 617.1239 660.2649 680.3009 704.5064 738.0609 763.6824 768.6112 812.5047 852.4998 861.2272 865.6542 899.9240 923.7787 948.9548 976.0305 985.6643 990.4555 996.7167 1013.4900 1026.5353 1034.0362 1081.3354 1095.6373 1123.4142 1165.3001 1168.8795 1174.2438 1188.6718 1216.1242 1229.6850 1272.9048 1302.0934 1326.1757 1376.5977 1383.3704 1431.9174 1440.4716 1444.9529 1445.1210 1485.6373 1524.7464 1566.5398 1594.8408 1607.0860 1616.3808 2991.4455 3043.0402 3120.4231 3121.4845 3134.4584 3135.3028 3147.7109 3148.6692 3162.7024 3164.7215 3173.9825
redmass: 4.9296 4.1362 5.8699 4.6555 5.8684 5.6092 5.3969 4.5398 2.1932 8.2696 2.7990 3.0941 4.4575 8.7730 5.2437 6.2020 5.0025 4.2784 6.0223 6.3636 5.7127 7.2011 1.6888 2.3704 2.1091 1.6567 4.3490 1.2495 4.9586 1.3971 1.8388 1.4808 1.3834 1.3917 1.3175 6.1111 1.3262 2.6921 2.2798 3.4479 1.5779 4.9822 1.7226 1.1021 1.1269 1.0519 1.1203 2.3693 2.2595 1.5420 1.7840 1.2710 4.6881 8.4558 2.8801 2.1833 1.1543 2.4249 2.3682 10.0843 6.2421 6.0961 7.2636 6.1920 1.0598 1.1000 1.0856 1.0884 1.0856 1.0915 1.0961 1.0903 1.0957 1.1016 1.0998
irintensity: 0.0983 0.1054 0.1893 3.2001 2.2310 1.6889 1.2256 0.0427 0.9084 0.6114 0.0022 7.1181 3.6463 1.0010 1.7624 1.3857 48.6564 0.9035 1.9893 0.1004 6.7764 2.7486 58.4385 27.2385 35.6821 69.9551 2.9819 0.0431 12.2627 1.0845 0.0215 4.1542 2.7436 0.0370 0.0502 1.0912 0.1563 18.0263 6.5831 9.0367 9.4607 59.7653 0.4191 0.4230 0.3414 0.1152 1.2519 4.8992 4.6615 0.4942 12.3078 0.1723 9.7731 0.0656 27.9754 8.2398 18.4883 3.1104 14.1315 75.4204 0.4938 1.0763 8.7672 1.9245 9.8835 4.2169 7.7206 2.1508 1.8002 13.5736 38.7459 8.4123 17.2664 23.8858 21.4722
temp: 298.150 k
press: 1.00000 atm
elementType: 16 7 6 6 6 6 6 6 6 6 6 6 6 6 6 6 1 1 1 1 1 1 1 1 1 1 1
symmnumber: 1
zpe: 543911.9 jmol-1
zpe.correction: 0.207165 hartree
zpe.thermalcorrener: 0.219175 hartree
zpe.thermalcorrenthalpy: 0.220120 hartree
zpe.thermalcorrgfe: 0.166661 hartree
zpe.sumelectzpe: -991.812091 hartree
zpe.sumelectthermal: -991.800081 hartree
zpe.sumelectthermalent: -991.799137 hartree
zpe.sumelectthermalfe: -991.852595 hartree
dipole: 0.5372 -0.9061 0.0001
dipole: 1.0534
quadrupole: -85.8454 -97.9085 -97.9021
quadrupole: 0.3978 -0.0407 -0.0079
quadrupole: 8.0399 -4.0232 -4.0168 0.3978 -0.0407 -0.0079
hfenergy: -992.0192564 hartree
pointgroup: C01 [X(C14H11N1S1)]
dipole: -0.1911721 -0.1083145 0.3513845 debye
polarizability: 249.1631509|9.1942269|113.6189361|-17.3923673|-11.3434457|147.3445737 unknown
InChI: InChI=1S/C14H11NS/c1-2-6-11(7-3-1)10-14-15-12-8-4-5-9-13(12)16-14/h1-9H,10H2
charge 0 multiplicity 1
27 atoms
S  0.330808 -0.175894 0.949123
N  1.233623 0.553021 -1.486098
C  -1.267393 0.467228 -1.437681
C  0.114297 0.331914 -0.832444
C  -2.424494 0.152825 -0.500169
C  2.114496 -0.041885 0.666987
C  2.378535 0.355747 -0.686114
C  -3.012692 1.173336 0.289493
C  -2.92964 -1.168017 -0.394389
C  3.162461 -0.275013 1.579906
C  3.71454 0.519839 -1.122464
C  4.490249 -0.106651 1.127249
C  4.762966 0.287073 -0.211451
C  -4.080115 0.881169 1.16802
C  -3.996773 -1.464511 0.482944
C  -4.575623 -0.43963 1.266852
H  -1.298601 -0.194676 -2.324299
H  -1.353045 1.501328 -1.82297
H  -2.63242 2.199661 0.215722
H  -2.484233 -1.966483 -1.000577
H  2.961851 -0.578302 2.612084
H  3.905141 0.823179 -2.156228
H  5.319546 -0.283121 1.820787
H  5.801491 0.41036 -0.536655
H  -4.525057 1.680734 1.770863
H  -4.376753 -2.489883 0.553058
H  -5.405364 -0.667249 1.94545
