program: Gaussian 09
title: 000233991
version: EM64L-G09RevD.01
frameworkgroup: C1[X(C11H7NOS)]
method: RPBEPBE
basis: SDD
operation: Freq
keyword: #p
keyword: freq=noraman
keyword: PBEPBE/SDD
title: #p freq=noraman PBEPBE/SDD
converged: NO NO NO NO
title: Mulliken charges:
elementType: S O N C C C C C C C C C C C H H H H H H H
charge: 0.280653 -0.236856 -0.020696 -0.352634 0.331419 -0.364314 0.435859 -0.275474 -0.349330 -0.356563 -0.238022 -0.213582 -0.253079 -0.159911 0.245814 0.258908 0.280288 0.230828 0.231731 0.259167 0.265795
chargesum: 0.00000
title: Mulliken charges with hydrogens summed into heavy atoms:
elementType: S O N C C C C C C C C C C C
charge: 0.280653 -0.236856 -0.020696 -0.352634 0.331419 -0.364314 0.435859 -0.029660 -0.090422 -0.076276 -0.007193 0.018148 0.006088 0.105884
polarizability: 2.88455098e+02 8.03720797e-01 1.40884698e+02 8.83574517e-04 -1.36355278e-03 5.39584380e+01
1716.lowfreq: 0.0021 0.0021 0.0025 6.6564 7.0725 10.0690 59.7645 67.8304 95.2997
frequency: 59.7506 67.8191 95.2997 180.2024 196.7783 289.7278 301.0406 322.6404 399.7513 437.1973 487.6091 526.0086 574.8535 582.4153 591.4277 637.0667 657.5689 679.3345 733.6380 736.7449 766.2391 809.7376 828.9609 855.2280 863.7481 871.9003 891.0465 932.6994 947.3639 985.0133 1008.0100 1015.8992 1041.4475 1053.2850 1116.9624 1134.6543 1168.3310 1187.7555 1216.9039 1256.2846 1288.8083 1363.2574 1374.7642 1430.6336 1442.0068 1453.9964 1499.9273 1562.0461 1587.1093 1623.1648 3135.6132 3149.4140 3163.5152 3174.9538 3224.4224 3244.4905 3268.3051
redmass: 4.9712 5.8102 5.7499 5.7314 5.6695 8.2561 5.8001 6.2623 10.2265 3.1636 8.9278 5.1387 8.5798 3.5410 4.5019 9.5355 5.0567 7.2172 2.4951 1.2687 1.5852 7.1778 1.3177 7.1120 1.3905 6.2625 1.3776 4.1841 1.3804 1.3189 1.6775 2.1265 4.1734 3.2339 1.5749 1.5898 1.2162 2.8263 1.7274 1.8953 2.7372 2.6258 4.4434 2.9633 2.7604 6.0449 5.8115 6.1678 7.1599 8.9186 1.0856 1.0904 1.0957 1.0997 1.0917 1.0996 1.1083
irintensity: 0.9668 3.7403 2.0989 1.7578 0.4227 0.2958 2.2899 0.4701 0.1681 10.3964 0.4178 0.0016 1.8636 7.6235 1.6424 28.1646 0.5011 1.6799 10.3303 104.5519 74.4709 17.9929 28.0721 48.3542 1.3489 1.1000 0.6512 6.6866 2.9077 0.0475 32.3330 11.0597 7.7044 24.5055 7.2715 3.1678 0.8405 11.0750 11.1156 11.2824 15.4065 3.6615 14.2673 14.7138 9.4089 0.6262 63.2437 7.9557 8.1742 38.7992 1.6579 8.3766 18.1670 22.0290 5.4732 0.6152 0.0504
temp: 298.150 k
press: 1.00000 atm
elementType: 16 8 7 6 6 6 6 6 6 6 6 6 6 6 1 1 1 1 1 1 1
symmnumber: 1
zpe: 391745.7 jmol-1
zpe.correction: 0.149208 hartree
zpe.thermalcorrener: 0.159837 hartree
zpe.thermalcorrenthalpy: 0.160781 hartree
zpe.thermalcorrgfe: 0.111870 hartree
zpe.sumelectzpe: -950.435997 hartree
zpe.sumelectthermal: -950.425368 hartree
zpe.sumelectthermalent: -950.424424 hartree
zpe.sumelectthermalfe: -950.473335 hartree
dipole: -0.6671 0.0891 -0.0002
dipole: 0.6730
quadrupole: -61.3827 -82.3150 -93.1455
quadrupole: -1.9923 0.0005 -0.0008
quadrupole: 17.5650 -3.3672 -14.1978 -1.9923 0.0005 -0.0008
hfenergy: -950.5852051 hartree
pointgroup: C01 [X(C11H7N1O1S1)]
dipole: -0.2622103 -0.0367958 0.0000911 debye
dipolederiv: -0.2198586 -0.073364 0.0000616 -0.1839649 -0.3960953 0.0004479 0.0001548 0.000448 0.0941428 -0.1205345 -0.176615 0.0002484 -0.1641854 -0.5392762 0.0004715 0.0001361 0.0004365 -0.1173615 -0.5805689 0.2346549 -0.0002283 0.2170729 -0.6710244 0.0004483 -0.0002045 0.0004601 -0.1937424 0.1964233 -0.220011 0.0001998 -0.2194024 -0.0577108 -0.0000383 0.0002006 -0.0000345 -0.0931715 0.2533722 -0.0970316 0.0001029 0.1021671 -0.0052469 0.0000812 -0.0000925 0.0000653 0.0771306 0.9433603 0.1427862 -0.0001023 0.3245479 0.942482 -0.0008347 -0.0002508 -0.0008461 0.0135689 -0.3410698 0.0146305 -0.0000459 -0.3516949 0.1754435 -0.0001826 0.0003717 -0.0001997 0.0226007 -0.0306544 0.1088858 -0.000095 0.1617547 0.0895857 -0.0001985 -0.0001428 -0.0001963 -0.1235922 0.106541 0.0516767 -0.0000389 -0.0330741 0.0905001 -0.0002335 0.0000333 -0.0002258 -0.1533112 0.2527301 -0.0690668 0.0000701 -0.020613 -0.0198996 -0.0001571 -0.0000284 -0.000175 -0.1566961 -0.0946719 0.0301556 -0.0000293 0.1248571 0.0732723 -0.0002205 -0.0001126 -0.0002284 -0.1657792 -0.0700053 -0.1234479 0.0001164 -0.2776375 -0.031059 -0.000142 0.0002703 -0.000133 -0.1658179 -0.1369231 0.0518367 -0.0000755 0.3478528 -0.0981832 -0.0001125 -0.0004317 -0.0001104 -0.2014665 -0.3027028 0.1084783 -0.000155 -0.0481055 0.2872286 -0.0004977 -0.0000162 -0.0003923 -0.1205758 0.0804818 0.0087731 -0.0000106 -0.0562252 -0.0614523 0.0002155 0.000052 0.000215 0.1663965 0.0880587 -0.0420252 0.0000377 0.0063068 -0.050339 0.0002094 -0.0000115 0.000206 0.1699792 0.118515 0.0576704 -0.0000556 0.0598942 0.0445908 0.0001744 -0.0000132 0.0001925 0.1966076 -0.1129354 -0.0712532 0.0000596 -0.0697833 0.0591518 0.0000997 0.0000529 0.0000996 0.1654215 -0.0754973 0.1007976 -0.0001032 0.112722 0.0160968 0.000144 -0.0001119 0.000144 0.1635014 -0.0246177 -0.0620877 0.000078 -0.0701717 0.1001245 0.0001181 0.0000791 0.0001025 0.2006816 0.0705573 0.0245567 -0.0000348 0.0376825 0.0518105 0.0002076 0.0000651 0.0001719 0.2214834 unknown
polarizability: 288.4592488|0.1827292|140.8804586|0.0077739|-0.0875071|53.9585264 unknown
InChI: InChI=1S/C11H7NOS/c1-2-6-10-8(4-1)12-11(14-10)9-5-3-7-13-9/h1-7H
charge 0 multiplicity 1
21 atoms
S  0.114773 1.67075 -0.002127
O  -2.866184 1.041151 -0.001868
N  0.179662 -1.039206 0.000413
C  1.709787 0.812602 -0.001281
C  1.517853 -0.611585 0.000073
C  -0.667776 -0.021374 -0.000585
C  -2.10241 -0.151476 -0.000525
C  2.999598 1.378966 -0.001792
C  2.644288 -1.470414 0.000925
C  -2.960211 -1.249555 0.000593
C  4.110834 0.505964 -0.000925
C  3.933683 -0.905184 0.000423
C  -4.306994 -0.734517 0.000224
C  -4.213925 0.650252 -0.001588
H  3.145818 2.463536 -0.002821
H  2.487618 -2.553025 0.001945
H  -2.646164 -2.290716 0.001733
H  5.12232 0.926279 -0.001295
H  4.812411 -1.558877 0.001071
H  -5.226029 -1.317211 0.000986
H  -4.93805 1.460341 -0.002582
