program: Gaussian 09
title: 000233992
version: EM64L-G09RevD.01
frameworkgroup: C1[X(C13H7Cl2NS)]
method: RPBEPBE
basis: SDD
operation: Freq
keyword: #p
keyword: freq=noraman
keyword: PBEPBE/SDD
title: #p freq=noraman PBEPBE/SDD
converged: YES YES NO NO
title: Mulliken charges:
elementType: Cl Cl S N C C C C C C C C C C C C C H H H H H H H
charge: -0.007700 0.004634 0.238976 -0.029979 -0.372563 0.570756 -0.336114 0.326220 -0.330856 -0.401652 -0.275710 -0.344357 -0.235098 -0.211084 -0.079358 -0.190885 -0.114698 0.263169 0.285515 0.248997 0.260901 0.233616 0.234684 0.262586
chargesum: 0.00000
title: Mulliken charges with hydrogens summed into heavy atoms:
elementType: Cl Cl S N C C C C C C C C C C C C C
charge: -0.007700 0.004634 0.238976 -0.029979 -0.372563 0.570756 -0.336114 0.326220 -0.067687 -0.116137 -0.026713 -0.083456 -0.001482 0.023600 -0.079358 0.071700 -0.114698
polarizability: 3.75305180e+02 -1.82378640e+00 1.81779314e+02 2.81598567e-02 -3.10031621e-02 6.46485738e+01
1716.lowfreq: -3.6141 -1.9921 -0.0030 -0.0017 0.0018 3.3125 26.9040 43.3859 71.3552
frequency: 26.9005 43.3787 71.3540 106.9387 163.1332 176.5967 188.9020 217.1873 225.8031 251.6917 336.5179 348.7711 397.2654 428.7549 431.8083 439.9794 477.9365 488.2509 509.0984 571.0966 585.9923 628.5540 633.3575 664.7980 681.5851 707.9996 734.3818 741.0604 768.7459 837.6540 853.6296 866.3732 882.8096 923.8488 950.6180 980.2610 987.8738 1002.6032 1015.7711 1042.5511 1118.3327 1123.2310 1143.8711 1170.0990 1196.9825 1249.4713 1260.4474 1293.0523 1357.8142 1376.0638 1386.2733 1430.7575 1444.1109 1453.8316 1522.2454 1557.6357 1565.3923 1591.6306 1608.2034 3138.9467 3153.1705 3156.1802 3162.6663 3166.9502 3177.3905 3182.0286
redmass: 8.7827 8.4335 8.7388 6.7763 5.5334 23.9209 5.8347 12.1146 11.4181 6.8710 6.1175 7.6897 11.7398 7.2997 3.0637 3.2068 9.4693 9.3703 5.5977 4.3355 8.0420 6.7112 8.4712 7.5755 7.4352 3.1811 2.5613 8.9232 1.5760 1.3444 7.0237 1.3899 1.5915 7.2079 1.3816 1.3549 1.3231 5.0786 2.2387 5.0127 1.5553 2.4480 1.3193 1.1666 3.0346 1.6603 1.5082 2.4591 4.3474 4.8215 4.6962 2.9408 2.5381 2.9730 9.3696 8.4055 6.2693 6.5421 7.2229 1.0859 1.0904 1.0921 1.0890 1.0957 1.0999 1.0973
irintensity: 0.1714 0.2124 0.4882 1.9051 0.0038 0.0014 1.3676 0.3372 2.6458 0.8447 1.7047 5.3297 5.3759 4.6221 0.4388 14.9599 19.0350 2.0755 1.9492 2.5533 5.7995 1.6678 16.2457 31.8302 1.0453 4.0890 23.3102 9.4841 78.2397 27.7551 7.5928 0.7482 28.4352 99.1657 2.8542 1.1968 0.0294 24.4342 10.0406 6.6479 5.1575 59.0429 0.7376 0.1812 29.9944 7.6490 2.6598 15.5576 8.2999 8.1229 24.2457 16.4817 16.0709 113.3232 32.2120 14.7500 8.9926 6.2483 5.4901 1.8826 7.9578 1.9469 0.6161 14.2726 22.7120 1.8930
temp: 298.150 k
press: 1.00000 atm
elementType: 17 17 16 7 6 6 6 6 6 6 6 6 6 6 6 6 6 1 1 1 1 1 1 1
symmnumber: 1
zpe: 420957.6 jmol-1
zpe.correction: 0.160334 hartree
zpe.thermalcorrener: 0.174330 hartree
zpe.thermalcorrenthalpy: 0.175274 hartree
zpe.thermalcorrgfe: 0.117543 hartree
zpe.sumelectzpe: -1871.369777 hartree
zpe.sumelectthermal: -1871.355781 hartree
zpe.sumelectthermalent: -1871.354837 hartree
zpe.sumelectthermalfe: -1871.412568 hartree
dipole: 3.3277 -0.5307 -0.0007
dipole: 3.3698
quadrupole: -109.4274 -109.9390 -123.8885
quadrupole: 4.7524 0.0047 -0.0016
quadrupole: 4.9909 4.4793 -9.4702 4.7524 0.0047 -0.0016
hfenergy: -1871.5301112 hartree
pointgroup: C01 [X(C13H7Cl2N1S1)]
dipole: 1.3079166 -0.2165567 -0.0116858 debye
dipolederiv: -0.3587457 0.2775362 0.0070245 0.434604 -0.4736711 -0.0106806 0.0099124 -0.0097935 -0.031938 -0.9932964 -0.1486738 0.0028157 -0.1822187 -0.0813837 -0.0000233 0.0020467 -0.0002126 -0.0229364 -0.3362677 -0.0511026 0.0015069 -0.1941474 -0.4316754 -0.0069281 -0.0005541 -0.0078726 0.0714306 -0.4463031 0.2499526 0.0055371 0.1113246 -0.6621024 -0.0084054 0.0036423 -0.0094579 -0.1771161 0.7055585 0.1261242 -0.0023807 0.5260131 0.9271837 0.0122628 0.0040808 0.0151361 -0.038985 0.0713531 0.0033791 -0.0001729 -0.1729311 -0.0472763 -0.0004184 -0.0035775 -0.0015948 0.0433157 0.2664324 -0.2022537 -0.0050414 -0.1669305 -0.0468306 0.0013667 -0.0046882 0.0016439 -0.0738877 0.0946316 -0.1188315 -0.0019692 0.0201755 0.0021866 -0.001208 0.0003705 -0.0004772 0.0731463 -0.1281017 0.1674235 0.0033771 0.0873385 -0.1646565 -0.0015797 0.0022679 -0.0020714 -0.0987382 -0.1003089 -0.0625652 -0.0012782 0.0823557 0.0117921 0.0020646 0.001268 0.0028171 -0.1283538 -0.1001142 0.1083569 0.0015968 0.1799823 0.0901473 0.0024371 0.0026261 0.0028145 -0.122718 0.1600495 0.0643901 -0.0007139 -0.0650411 0.0931582 0.0042559 -0.0028516 0.0035166 -0.1464412 -0.0721784 0.0319873 0.0000774 0.1180279 0.0845494 0.0032271 0.0014058 0.0037526 -0.1578783 -0.0839433 -0.1365413 -0.0026358 -0.3051791 -0.0425929 0.0037033 -0.0054271 0.0026763 -0.1622653 0.2140231 -0.6076146 -0.0126981 -0.8660737 0.6747225 0.0180193 -0.017612 0.0165248 -0.0280065 -0.2809086 -0.0148614 0.0008375 0.1231532 0.0449124 0.0015623 0.0033978 0.0023656 -0.081366 1.1745721 0.3574942 -0.0003491 0.3502153 -0.0271557 -0.0014741 -0.0001855 -0.0014792 -0.0607157 0.0963799 -0.0723104 -0.0009402 -0.0795188 0.0241324 -0.0020412 -0.0011505 -0.002036 0.1581887 0.0877538 0.0769601 0.0018033 0.0543963 0.0515992 -0.0022809 0.0015121 -0.002336 0.158505 0.083035 0.0131543 0.0006735 -0.0545753 -0.0534907 -0.0032755 -0.0004057 -0.003676 0.1674881 0.0920852 -0.0426273 -0.0002619 0.008574 -0.0436315 -0.0034997 0.0005995 -0.0032388 0.1694793 -0.1088957 -0.0705679 0.0003851 -0.0686192 0.0606213 -0.0013012 0.0004938 -0.0012732 0.1643669 -0.0763084 0.0966341 0.0029176 0.1100185 0.0210137 -0.0029343 0.0031115 -0.0028424 0.1635771 0.0394978 -0.0454429 -0.0001111 -0.0509441 -0.0115518 -0.0028487 -0.0002831 -0.0028858 0.1618485 unknown
polarizability: 375.2656943|-2.9645671|181.7735113|-1.8396563|2.0246777|64.6938621 unknown
InChI: InChI=1S/C13H7Cl2NS/c14-9-6-5-8(7-10(9)15)13-16-11-3-1-2-4-12(11)17-13/h1-7H
charge 0 multiplicity 1
24 atoms
Cl -4.488963 2.233674 0.080075
Cl -5.747068 -0.806014 0.031321
S  1.085601 1.706328 0.033745
N  1.173738 -0.991143 -0.010618
C  0.30673 0.004737 0.010904
C  -1.151816 -0.152951 0.016839
C  2.687358 0.869015 0.011281
C  2.507667 -0.555781 -0.010716
C  -2.025784 0.96475 0.042303
C  -1.706029 -1.464375 -0.003491
C  3.970286 1.448973 0.013566
C  3.641064 -1.404872 -0.03082
C  5.088651 0.585247 -0.006592
C  4.924564 -0.827169 -0.028673
C  -3.419223 0.773935 0.046971
C  -3.099069 -1.64802 0.001313
C  -3.961892 -0.529468 0.026424
H  -1.633164 1.986499 0.059059
H  -1.027446 -2.321302 -0.022907
H  4.106347 2.534266 0.030404
H  3.495886 -2.488823 -0.04759
H  6.096409 1.013955 -0.00526
H  5.809427 -1.471974 -0.044117
H  -3.529277 -2.653385 -0.014422
