program: Gaussian 09
title: 000233989
version: EM64L-G09RevD.01
frameworkgroup: C1[X(C17H21NO6)]
method: RPBEPBE
basis: SDD
operation: Freq
keyword: #p
keyword: freq=noraman
keyword: PBEPBE/SDD
title: #p freq=noraman PBEPBE/SDD
converged: YES YES NO NO
title: Mulliken charges:
elementType: O O O O O O N C C C C C C C C C C C C C C C C C H H H H H H H H H H H H H H H H H H H H H
charge: -0.284999 -0.256852 -0.221961 -0.218480 -0.233061 -0.288245 -0.425317 0.147063 -0.599500 0.201557 0.223433 0.193621 0.268490 0.264994 -0.253604 -0.255943 -0.350234 -0.329536 -0.786225 -0.231496 -0.248066 -0.661798 -0.666186 -0.222439 0.301098 0.292244 0.354550 0.242322 0.223908 0.240869 0.223083 0.275557 0.249784 0.256387 0.250757 0.220031 0.233538 0.232563 0.217752 0.232834 0.251590 0.250358 0.217315 0.234187 0.234056
chargesum: 0.00000
title: Mulliken charges with hydrogens summed into heavy atoms:
elementType: O O O O O O N C C C C C C C C C C C C C C C C C
charge: -0.284999 -0.256852 -0.221961 -0.218480 -0.233061 -0.288245 -0.070767 0.147063 -0.006157 0.201557 0.223433 0.193621 0.268490 0.264994 0.212626 0.208010 -0.074677 -0.079752 -0.059051 0.002042 -0.015503 0.040377 0.035673 0.011617
polarizability: 2.53039852e+02 -1.01663056e+01 2.12107720e+02 -6.79557567e+00 1.17785262e+01 1.70134296e+02
1716.lowfreq: -5.9415 -2.0276 -0.0007 -0.0006 -0.0005 5.1124 22.0251 29.2755 31.3595
frequency: 21.8350 29.1695 31.3003 36.6430 46.7676 50.9786 56.2545 66.4744 77.9304 90.4597 102.4884 108.4633 115.9348 120.6794 151.6101 158.4971 163.3481 198.2279 203.1170 218.1623 230.5726 274.1928 296.8264 300.3539 309.8311 318.5458 350.1399 362.7649 399.1223 416.3238 422.1964 441.5230 457.0703 516.6372 553.6479 563.5731 575.3647 596.2195 613.0625 616.1033 632.7026 663.6959 695.4728 720.1223 738.0757 763.1416 770.5324 792.2530 816.8622 817.2558 828.8712 846.6177 858.7387 897.4442 931.8352 954.2288 975.4483 989.4466 991.9085 997.5169 1006.3616 1010.7128 1011.0393 1018.5558 1029.1115 1044.0290 1059.3514 1086.1763 1094.4938 1098.2569 1124.2567 1157.2971 1157.7907 1159.0626 1173.5035 1182.9953 1191.6120 1234.4241 1253.9980 1275.1467 1275.5734 1283.7248 1313.1892 1336.4371 1351.3906 1353.0808 1387.8557 1388.2078 1391.5657 1392.4199 1423.0210 1436.8489 1448.3817 1458.0097 1458.9787 1462.4443 1464.5260 1464.9648 1479.5419 1480.1645 1484.7194 1485.5930 1562.7068 1595.1326 1598.9564 1611.7682 1636.1778 1639.8482 2994.2595 2994.7271 2998.3771 3018.2686 3034.2629 3034.8364 3078.4065 3089.9168 3090.3749 3094.3194 3097.2180 3097.3267 3110.3495 3123.3665 3123.4233 3129.8017 3140.2385 3151.4151 3160.5256 3170.4377 3551.9902
redmass: 5.0412 3.8403 3.8024 3.5473 3.7774 2.6583 4.3751 1.6958 2.0802 3.8095 3.9747 6.5096 5.0853 5.0286 5.4013 4.8947 4.1916 1.5942 3.5311 1.5385 2.4488 2.7157 3.5969 4.2439 3.2963 3.6631 5.0902 4.8448 2.7939 3.2539 3.7666 3.7806 5.8566 3.9105 2.4539 4.1719 3.2430 2.1763 5.1939 2.9741 5.8281 5.4271 1.7918 4.1742 3.7307 3.3570 1.8901 2.5886 1.6975 1.4617 3.6982 3.7963 1.2531 3.2916 2.3446 1.8382 2.6655 6.0594 1.3867 4.4462 1.8609 2.7732 1.4454 3.0539 2.0549 1.6661 3.1162 1.6040 2.2763 2.1542 4.3314 2.0541 1.6622 2.2176 1.0773 2.2004 1.6815 2.5305 1.8035 1.1372 1.1410 2.0072 1.4533 1.8411 1.2716 1.2830 1.2479 8.6884 1.2284 1.2297 1.1197 2.2052 1.0914 1.0932 1.0870 1.0624 1.1570 1.0452 1.8398 2.1844 1.0553 1.0524 7.0541 6.4890 6.5464 6.2492 9.8759 10.3485 1.0362 1.0362 1.0361 1.0602 1.0596 1.0594 1.0991 1.0972 1.0972 1.0986 1.1034 1.1032 1.1001 1.1065 1.1066 1.0852 1.0882 1.0924 1.0961 1.1013 1.0785
irintensity: 0.6678 0.2709 3.1667 0.9933 2.0588 0.4721 4.2325 1.0881 2.0404 9.4460 4.0386 2.0560 0.8392 3.6312 1.7061 0.4523 0.5178 7.2990 6.0240 2.3807 7.0956 2.2804 5.9454 14.6535 4.6737 13.3943 8.5930 5.9701 0.0421 1.0270 4.0676 0.6702 1.1079 34.5059 1.0926 4.9213 5.5304 179.0867 0.3928 9.2345 6.3701 20.8100 47.5452 4.5010 4.1464 16.4377 64.2627 1.6378 6.0906 4.7000 3.7297 16.0924 0.2780 4.8149 10.1422 1.4627 14.1649 0.1659 0.4638 45.9714 13.5571 25.4959 7.4941 87.2413 4.4855 14.2610 89.4098 2.9725 121.8423 5.1396 370.6240 54.1799 21.4813 78.8073 6.7160 119.2698 24.3090 88.6254 14.2356 3.3046 6.9840 35.7232 20.3380 133.5006 7.3685 1.1995 63.7432 3.7701 3.5355 47.5687 50.8586 31.8038 53.2569 33.2192 0.9934 26.8747 85.6100 14.4142 172.6467 17.2857 30.2099 7.4224 118.9728 10.3701 172.0145 10.6248 241.7611 50.0764 16.9076 20.0859 9.1154 32.1395 31.6600 19.5561 1.7359 44.7211 22.9223 11.9338 0.9245 0.7375 12.2493 31.9081 22.6566 0.1455 6.4740 15.1019 19.9280 22.2712 74.6211
temp: 298.150 k
press: 1.00000 atm
elementType: 8 8 8 8 8 8 7 6 6 6 6 6 6 6 6 6 6 6 6 6 6 6 6 6 1 1 1 1 1 1 1 1 1 1 1 1 1 1 1 1 1 1 1 1 1
symmnumber: 1
zpe: 931064.5 jmol-1
zpe.correction: 0.354624 hartree
zpe.thermalcorrener: 0.380318 hartree
zpe.thermalcorrenthalpy: 0.381262 hartree
zpe.thermalcorrgfe: 0.295819 hartree
zpe.sumelectzpe: -1164.728121 hartree
zpe.sumelectthermal: -1164.702426 hartree
zpe.sumelectthermalent: -1164.701482 hartree
zpe.sumelectthermalfe: -1164.786925 hartree
dipole: 1.0508 1.1426 -0.8471
dipole: 1.7684
quadrupole: -119.2358 -127.8436 -139.2354
quadrupole: -6.8193 2.3911 13.4940
quadrupole: 9.5358 0.9280 -10.4638 -6.8193 2.3911 13.4940
hfenergy: -1165.0827443 hartree
pointgroup: C01 [X(C17H21N1O6)]
dipole: 0.3560629 0.3546049 -0.4811907 debye
polarizability: 254.7046347|-7.7180244|212.7569907|-6.5520529|-4.0279287|167.8202429 unknown
InChI: InChI=1S/C17H21NO6/c1-4-23-15(21)17(18-12(3)19,16(22)24-5-2)11-14(20)13-9-7-6-8-10-13/h6-10,18H,4-5,11H2,1-3H3
charge 0 multiplicity 1
45 atoms
O  -2.073577 1.921496 -0.329544
O  -1.333144 -2.357355 -0.157769
O  -1.314397 0.461747 -1.985681
O  -2.869468 -1.192542 1.152993
O  1.063674 1.851783 -0.44638
O  -0.181909 -1.072319 2.918524
N  -0.825881 0.738657 1.625873
C  -0.806183 -0.034433 0.380416
C  0.624723 -0.495511 0.008041
C  -1.391389 0.805688 -0.787577
C  -1.785667 -1.250484 0.537528
C  1.541132 0.68378 -0.301874
C  3.009524 0.431758 -0.460417
C  -0.535333 0.149226 2.838684
C  -2.695822 2.796994 -1.37474
C  -2.236462 -3.554622 -0.156437
C  3.853533 1.531217 -0.778681
C  3.582142 -0.860521 -0.307788
C  -0.67789 1.04183 4.062775
C  5.239792 1.344855 -0.938154
C  4.971438 -1.046325 -0.469959
C  -4.086557 2.281172 -1.749645
C  -3.305584 -3.423362 -1.243819
C  5.802906 0.054149 -0.783621
H  0.574264 -1.155945 -0.876435
H  1.008509 -1.100557 0.847979
H  -1.172835 1.697496 1.561423
H  -2.018458 2.821703 -2.24572
H  -2.731244 3.786074 -0.891398
H  -2.683139 -3.647356 0.848679
H  -1.546616 -4.391758 -0.346699
H  3.392824 2.517883 -0.894527
H  2.951322 -1.720644 -0.061699
H  -1.557362 0.713104 4.644797
H  0.20914 0.919206 4.70587
H  -0.79892 2.109079 3.810771
H  5.883203 2.197257 -1.181792
H  5.406294 -2.044398 -0.349758
H  -4.564265 2.986695 -2.454706
H  -4.729308 2.193831 -0.857125
H  -4.019567 1.296143 -2.240362
H  -3.991967 -2.590231 -1.019369
H  -3.898692 -4.355405 -1.294155
H  -2.843725 -3.25146 -2.231037
H  6.881936 -0.092199 -0.906489
