program: Gaussian 09
title: 000233985
version: EM64L-G09RevD.01
frameworkgroup: C1[X(C13H24Cl2N2O2)]
method: RPBEPBE
basis: SDD
operation: Freq
keyword: #p
keyword: freq=noraman
keyword: PBEPBE/SDD
title: #p freq=noraman PBEPBE/SDD
converged: YES YES NO NO
title: Mulliken charges:
elementType: Cl Cl O O N N C C C C C C C C C C C C C H H H H H H H H H H H H H H H H H H H H H H H H
charge: -0.082757 -0.082439 -0.274679 -0.275454 -0.367574 -0.367335 -0.386012 -0.366170 -0.365819 -0.372461 -0.373889 -0.538463 -0.535622 0.248455 0.246533 -0.330736 -0.326138 -0.554663 -0.557282 0.195002 0.203445 0.188321 0.190243 0.188467 0.191045 0.202773 0.240841 0.201945 0.241599 0.209771 0.233186 0.232033 0.207921 0.309357 0.309171 0.244853 0.265957 0.266276 0.244829 0.268235 0.279705 0.279090 0.268440
chargesum: 0.00000
title: Mulliken charges with hydrogens summed into heavy atoms:
elementType: Cl Cl O O N N C C C C C C C C C C C C C
charge: -0.082757 -0.082439 -0.274679 -0.275454 -0.058217 -0.058164 0.012435 0.012394 0.013693 0.071154 0.069656 -0.095506 -0.095668 0.248455 0.246533 0.180073 0.184967 -0.006723 -0.009753
polarizability: 2.39743211e+02 -6.82682683e-01 1.77941370e+02 1.12434644e+00 3.22952032e+00 1.26632598e+02
1716.lowfreq: -15.7727 -3.8384 -0.0015 -0.0011 0.0011 2.4661 6.3076 8.4895 14.3023
frequency: -6.5810 8.0132 13.2938 25.4620 26.5507 34.9827 42.6314 46.3192 57.9988 76.9419 83.7110 106.8137 122.9508 127.6068 129.4240 143.2926 147.8832 202.6241 211.6298 253.1602 284.0554 301.2590 312.9233 367.7274 403.6506 426.0706 436.3821 485.0054 491.8181 574.8467 579.1386 598.1678 600.5540 608.1092 614.3666 698.3971 705.3547 721.1251 732.8048 762.3714 807.6723 817.0209 826.0410 894.1644 912.0787 916.6886 974.2759 982.4553 987.4463 998.7133 1008.2934 1024.5922 1032.1150 1055.0854 1073.5690 1078.6635 1081.9972 1087.7930 1091.4935 1126.7070 1129.5332 1165.1226 1166.4284 1195.0302 1200.1747 1217.4226 1218.6213 1233.7378 1235.3871 1255.4612 1257.3598 1278.3970 1286.9024 1288.3933 1292.4976 1295.7183 1298.9385 1313.5846 1333.7481 1349.7603 1357.4315 1357.9329 1365.0811 1366.5659 1440.5298 1441.1579 1443.2116 1445.3633 1445.8006 1448.4331 1462.6894 1463.0804 1471.3248 1479.9258 1480.9183 1481.5465 1488.2375 1615.3055 1616.3053 2946.6292 2949.4580 2961.9000 2969.0203 2971.4288 2981.8511 2982.7293 2988.7093 2990.7335 2992.7817 2996.8042 3020.6701 3023.3549 3029.6200 3048.1178 3050.7223 3058.6329 3061.2460 3065.5742 3065.7579 3153.6642 3153.8696 3547.0422 3547.5480
redmass: 3.3261 8.4184 5.9271 3.7169 3.5728 4.8731 6.7055 7.0104 6.3762 2.2274 3.1664 2.6361 3.8549 2.7537 3.0343 2.3898 2.7013 5.6765 6.8261 5.0246 3.9772 2.6589 2.1638 3.0408 3.3031 3.2148 3.0008 2.8874 2.8220 2.2532 2.2688 4.3534 3.0604 1.5433 1.5924 3.6831 3.4800 1.0735 1.1450 1.2840 1.7308 2.0533 1.5696 1.4149 2.8689 2.8511 1.6498 2.3523 1.7699 3.4158 4.4977 1.7765 1.8357 2.9325 2.4149 2.4709 2.0663 2.2381 1.6892 2.7241 2.1395 1.3091 1.2979 1.6194 1.3936 1.3819 1.3571 1.3524 1.3428 1.3467 1.3481 1.0720 1.2021 1.1733 1.1069 1.1677 1.1913 1.3009 1.4465 1.4778 1.6242 1.6170 1.4001 1.4026 1.1061 1.1044 1.1095 1.1004 1.1031 1.1126 1.0766 1.0654 1.0869 1.8991 1.9094 1.1013 1.0994 6.4324 6.4296 1.0591 1.0588 1.0596 1.0593 1.0595 1.0743 1.0694 1.0811 1.0590 1.0590 1.0956 1.0981 1.0994 1.1045 1.0990 1.0976 1.1031 1.1028 1.0619 1.0605 1.1119 1.1119 1.0777 1.0777
irintensity: 0.6336 0.1113 0.0083 0.0503 4.8373 3.9907 4.6847 4.0641 3.8599 0.3187 6.6356 12.1076 1.1895 3.9088 4.6260 0.3936 0.2439 9.0453 2.8559 1.3520 12.0839 1.4504 4.0729 33.1127 0.5560 2.3728 5.7145 6.7813 0.3677 81.8783 13.9153 41.2172 26.6702 84.1911 53.7058 2.9493 4.1832 14.7213 0.5724 4.6557 6.2376 15.4400 7.0439 1.8288 12.5662 0.7511 1.8649 22.6014 11.7616 5.2168 4.1408 7.3224 8.9422 4.9657 7.7990 2.6795 3.6318 2.4420 2.6998 0.7494 13.5143 5.2510 11.0330 2.4563 1.5286 21.4756 14.5251 209.3543 44.6404 22.2050 7.7614 6.1050 2.8393 10.0105 9.3097 20.1582 27.5838 41.2169 1.4332 20.9315 0.1487 0.2052 5.8737 6.4188 8.1625 8.3970 38.7122 13.2363 20.8727 35.7464 0.1898 0.5536 2.3812 415.6066 84.4606 5.5506 28.8997 88.4387 203.6999 0.1072 21.5420 51.2418 11.1159 8.4466 50.7973 7.1630 43.7531 50.6272 46.0520 0.3430 32.8375 8.5412 15.6514 7.0634 6.1359 2.5462 138.9513 25.1361 24.8799 14.3834 14.1890 25.0027 26.2404
temp: 298.150 k
press: 1.00000 atm
elementType: 17 17 8 8 7 7 6 6 6 6 6 6 6 6 6 6 6 6 6 1 1 1 1 1 1 1 1 1 1 1 1 1 1 1 1 1 1 1 1 1 1 1 1
symmnumber: 1
zpe: 948538.2 jmol-1
zpe.correction: 0.361279 hartree
zpe.thermalcorrener: 0.383957 hartree
zpe.thermalcorrenthalpy: 0.384901 hartree
zpe.thermalcorrgfe: 0.301355 hartree
zpe.sumelectzpe: -1688.365337 hartree
zpe.sumelectthermal: -1688.342658 hartree
zpe.sumelectthermalent: -1688.341714 hartree
zpe.sumelectthermalfe: -1688.425261 hartree
dipole: -0.0136 2.6952 0.8241
dipole: 2.8184
quadrupole: -123.1852 -147.9430 -127.3797
quadrupole: -0.2052 -0.9982 -0.9350
quadrupole: 9.6508 -15.1071 5.4563 -0.2052 -0.9982 -0.9350
hfenergy: -1688.7266157 hartree
pointgroup: C01 [X(C13H24Cl2N2O2)]
dipole: -0.0075773 -0.4206682 -1.0259152 debye
polarizability: 239.72353|1.8908456|144.0627007|-0.6444428|24.4997363|160.5309482 unknown
InChI: InChI=1S/C13H24Cl2N2O2/c14-8-10-16-12(18)6-4-2-1-3-5-7-13(19)17-11-9-15/h16-17H,1-11H2
charge 0 multiplicity 1
43 atoms
Cl -8.895522 -1.333482 -1.548771
Cl 8.866989 -1.037842 -1.846198
O  -5.188788 1.103463 1.273838
O  5.207577 0.880094 1.461692
N  -6.204903 0.182437 -0.604323
N  6.190135 0.206343 -0.535792
C  0.004661 0.368554 0.122823
C  -1.289548 -0.441098 -0.116272
C  1.29004 -0.458866 -0.102245
C  -2.57007 0.393316 0.100775
C  2.57945 0.348098 0.161461
C  -3.85983 -0.428849 -0.123178
C  3.860701 -0.484549 -0.079952
C  -5.12132 0.355932 0.249707
C  5.124901 0.260968 0.355999
C  -7.504525 0.809711 -0.352732
C  7.484682 0.825974 -0.242083
C  -8.607126 -0.202151 -0.044673
C  8.625215 -0.186293 -0.159829
H  0.014559 1.25278 -0.548187
H  0.001334 0.765659 1.158696
H  -1.279378 -0.850909 -1.148613
H  -1.302736 -1.317283 0.566137
H  1.296853 -0.848013 -1.142556
H  1.273506 -1.348238 0.562692
H  -2.566973 1.267286 -0.581214
H  -2.593845 0.800016 1.12896
H  2.596604 1.24766 -0.486418
H  2.596422 0.712291 1.205711
H  -3.914716 -0.79103 -1.168913
H  -3.826222 -1.327928 0.52614
H  3.800499 -1.411793 0.525616
H  3.927696 -0.796198 -1.140994
H  -6.125959 -0.448871 -1.404023
H  6.095936 -0.313832 -1.410415
H  -7.803885 1.440964 -1.210486
H  -7.366163 1.46518 0.529363
H  7.372925 1.322374 0.741907
H  7.72616 1.601251 -0.993719
H  -9.577249 0.284031 0.135837
H  -8.338593 -0.880042 0.777981
H  8.415887 -1.002261 0.546495
H  9.59072 0.294446 0.056158
